BDBM358735 4-acetyl-1-(5-(4-amino-5- (trifluoromethyl)pyrrolo[2,1-f][1,2,4] triazin-7-yl)-2-(methoxymethyl) phenyl)-3,3-dimethylpiperazin-2-one::US10214537, Example 814
SMILES: COCc1ccc(cc1N1CCN(C(C)=O)C(C)(C)C1=O)-c1cc(c2c(N)ncnn12)C(F)(F)F
InChI Key: InChIKey=WAIVTPKLTZYYFN-UHFFFAOYSA-N
Data: 1 IC50
Activity Spreadsheet -- Enzyme Inhibition Constant Data from BindingDB
Found 1 hit for monomerid = 358735
Trg + Lig
Ki
nM
ΔG°
kcal/mole
IC50
nM
Kd
nM
EC50/IC50
nM
koff
s-1
kon
M-1s-1
pHTemp
°C
Phosphatidylinositol 4,5-bisphosphate 3-kinase catalytic subunit delta isoform
(Homo sapiens (Human))
BDBM358735
(4-acetyl-1-(5-(4-amino-5- (trifluoromethyl)pyrrolo...)
Show SMILES COCc1ccc(cc1N1CCN(C(C)=O)C(C)(C)C1=O)-c1cc(c2c(N)ncnn12)C(F)(F)F
Show InChI InChI=1S/C23H25F3N6O3/c1-13(33)31-8-7-30(21(34)22(31,2)3)17-9-14(5-6-15(17)11-35-4)18-10-16(23(24,25)26)19-20(27)28-12-29-32(18)19/h5-6,9-10,12H,7-8,11H2,1-4H3,(H2,27,28,29)
NCI pathway
Reactome pathway
US Patent
n/an/a 0.200n/an/an/an/an/an/a
Bristol-Myers Squibb Company
US Patent
Assay Description
The ADP-Glo format PI3K assays were performed in Proxiplate 384-well plates (Perkin Elmer #6008280). The final assay volume was 2 μl prepared fr...
US Patent US10214537 (2019)
BindingDB Entry DOI: 10.7270/Q2HH6NB2