BDBM35881 5,6-di-p-tolyl-pyrazine-2-carboxylic acid phenylamide::5,6-diaryl-pyrazine-2-amide derivative, 7b::CHEMBL225242::N-phenyl-5,6-dip-tolylpyrazine-2-carboxamide
SMILES: Cc1ccc(cc1)-c1ncc(nc1-c1ccc(C)cc1)C(=O)Nc1ccccc1
InChI Key: InChIKey=AKCXCZPEESTMSV-UHFFFAOYSA-N
Data: 1 KI  1 IC50
Activity Spreadsheet -- Enzyme Inhibition Constant Data from BindingDB
Found 2 hits for monomerid = 35881
Trg + Lig
Ki
nM
ΔG°
kcal/mole
IC50
nM
Kd
nM
EC50/IC50
nM
koff
s-1
kon
M-1s-1
pHTemp
°C
Cannabinoid receptor 1
(Homo sapiens (Human))
BDBM35881
(5,6-di-p-tolyl-pyrazine-2-carboxylic acid phenylam...)
Show SMILES Cc1ccc(cc1)-c1ncc(nc1-c1ccc(C)cc1)C(=O)Nc1ccccc1
Show InChI InChI=1S/C25H21N3O/c1-17-8-12-19(13-9-17)23-24(20-14-10-18(2)11-15-20)28-22(16-26-23)25(29)27-21-6-4-3-5-7-21/h3-16H,1-2H3,(H,27,29)
NCI pathway
Reactome pathway
509n/an/an/an/an/an/an/an/a
Pharmaceutical Research Institute
Curated by ChEMBL
Assay Description
Binding affinity to human CB1 receptor
Bioorg Med Chem Lett 17: 3978-82 (2007)
Article DOI: 10.1016/j.bmcl.2007.04.087
BindingDB Entry DOI: 10.7270/Q2FN15XR
Cannabinoid receptor 1
(Homo sapiens (Human))
BDBM35881
(5,6-di-p-tolyl-pyrazine-2-carboxylic acid phenylam...)
Show SMILES Cc1ccc(cc1)-c1ncc(nc1-c1ccc(C)cc1)C(=O)Nc1ccccc1
Show InChI InChI=1S/C25H21N3O/c1-17-8-12-19(13-9-17)23-24(20-14-10-18(2)11-15-20)28-22(16-26-23)25(29)27-21-6-4-3-5-7-21/h3-16H,1-2H3,(H,27,29)
NCI pathway
Reactome pathway
n/an/a 326n/an/an/an/a7.430
AstraZeneca
Assay Description
A GTP-gamma-S CB1 functional assay was used to assess the potency of the pyrazine derivatives. [35S]GTP-gamma-S binding assays were performed at 30 d...
Bioorg Med Chem 15: 4077-84 (2007)
Article DOI: 10.1016/j.bmc.2007.03.075
BindingDB Entry DOI: 10.7270/Q2028PW8