BDBM3594 4-N-(3-bromophenyl)-7-N-methylpyrido[4,3-d]pyrimidine-4,7-diamine::4-[(3-Bromophenyl)amino]-7-(methylamino)pyrido[4,3-d]pyrimidine::CHEMBL54400::Pyrido[4,3-d]pyrimidine 5f
SMILES: CNc1cc2ncnc(Nc3cccc(Br)c3)c2cn1
InChI Key: InChIKey=SOVBDLAXFPZPCR-UHFFFAOYSA-N
Data: 2 IC50
Activity Spreadsheet -- Enzyme Inhibition Constant Data from BindingDB
Found 2 hits for monomerid = 3594
Trg + Lig
Ki
nM
ΔG°
kcal/mole
IC50
nM
Kd
nM
EC50/IC50
nM
koff
s-1
kon
M-1s-1
pHTemp
°C
Epidermal growth factor receptor
(Homo sapiens (Human))
BDBM3594
(4-N-(3-bromophenyl)-7-N-methylpyrido[4,3-d]pyrimid...)
Show SMILES CNc1cc2ncnc(Nc3cccc(Br)c3)c2cn1
Show InChI InChI=1S/C14H12BrN5/c1-16-13-6-12-11(7-17-13)14(19-8-18-12)20-10-4-2-3-9(15)5-10/h2-8H,1H3,(H,16,17)(H,18,19,20)
n/an/a 0.130n/an/an/an/a7.425
University of Auckland
Assay Description
IC50 is the inhibitor concentration which inhibits 50% of kinase activity that catalyzes the transfer of the terminal phosphate from [gamma-32P] labe...
J Med Chem 40: 3915-25 (1997)
Article DOI: 10.1021/jm970366v
BindingDB Entry DOI: 10.7270/Q2NS0S2V
Epidermal growth factor receptor
(Homo sapiens (Human))
BDBM3594
(4-N-(3-bromophenyl)-7-N-methylpyrido[4,3-d]pyrimid...)
Show SMILES CNc1cc2ncnc(Nc3cccc(Br)c3)c2cn1
Show InChI InChI=1S/C14H12BrN5/c1-16-13-6-12-11(7-17-13)14(19-8-18-12)20-10-4-2-3-9(15)5-10/h2-8H,1H3,(H,16,17)(H,18,19,20)
n/an/a 0.130n/an/an/an/a7.422
University of Auckland
Assay Description
IC50 is the inhibitor concentration which inhibits 50% of kinase activity that catalyzes the transfer of the terminal phosphate from [gamma-32P] labe...
J Med Chem 39: 1823-35 (1996)
Article DOI: 10.1021/jm9508651
BindingDB Entry DOI: 10.7270/Q2X928GF