BDBM359570 (R or S)-4-(1-(2- chloro-6-(1- (trifluoromethyl)cyclo- propyl)benzoyl)-6- (2-methyl-1,4,5,6- tetrahydropyrrolo[3,4- d]imidazole-5- carbonyl)-4,5,6,7- tetrahydro-1H- indazol-3-yl)-3- fluorobenzoic acid::US10221142, Example 21JJ
SMILES: Cc1nc2CN(Cc2[nH]1)C(=O)C1CCc2c(C1)n(nc2-c1ccc(cc1F)C(O)=O)C(=O)c1c(Cl)cccc1C1(CC1)C(F)(F)F
InChI Key:
Data: 1 IC50
Activity Spreadsheet -- Enzyme Inhibition Constant Data from BindingDB
Found 1 hit for monomerid = 359570
Trg + Lig
Ki
nM
ΔG°
kcal/mole
IC50
nM
Kd
nM
EC50/IC50
nM
koff
s-1
kon
M-1s-1
pHTemp
°C
Nuclear receptor ROR-gamma (RORC)
(Homo sapiens (Human))
BDBM359570
((R or S)-4-(1-(2- chloro-6-(1- (trifluoromethyl)cy...)
Show SMILES Cc1nc2CN(Cc2[nH]1)C(=O)C1CCc2c(C1)n(nc2-c1ccc(cc1F)C(O)=O)C(=O)c1c(Cl)cccc1C1(CC1)C(F)(F)F
US Patent
n/an/a 0.600n/an/an/an/an/an/a
Merck Sharp & Dohme Corp.
US Patent
Assay Description
The compounds of the invention inhibit RORgammaT activity. Activation of RORgammaT activity can be measured using, e.g., biochemical TR-FRET assay. I...
US Patent US10221142 (2019)
BindingDB Entry DOI: 10.7270/Q2M90BZ0