null
SMILES: OC(=O)c1ccc(-c2nn(C(=O)c3c(Cl)cccc3C3(CC3)C(F)(F)F)c3CC(CCc23)C(=O)N2CC3(COC3)C2)c(F)c1
InChI Key: InChIKey=QPGKZADNGGWJDK-UHFFFAOYSA-N
Activity Spreadsheet -- Enzyme Inhibition Constant Data from BindingDB
Found 1 hit for monomerid = 359582
Trg + Lig
Ki
nM
ΔG°
kcal/mole
IC50
nM
Kd
nM
EC50/IC50
nM
koff
s-1
kon
M-1s-1
pHTemp
°C
Nuclear receptor ROR-gamma
(Homo sapiens (Human))
BDBM359582
((R or S)-4-(1-(2- chloro-6-(1- (trifluoromethyl)cy...)
Show SMILES OC(=O)c1ccc(-c2nn(C(=O)c3c(Cl)cccc3C3(CC3)C(F)(F)F)c3CC(CCc23)C(=O)N2CC3(COC3)C2)c(F)c1
Show InChI InChI=1S/C31H26ClF4N3O5/c32-21-3-1-2-20(30(8-9-30)31(34,35)36)24(21)27(41)39-23-11-16(26(40)38-12-29(13-38)14-44-15-29)4-7-19(23)25(37-39)18-6-5-17(28(42)43)10-22(18)33/h1-3,5-6,10,16H,4,7-9,11-15H2,(H,42,43)
US Patent
n/an/a 0.700n/an/an/an/an/an/a
Merck Sharp & Dohme Corp.
US Patent
Assay Description
The compounds of the invention inhibit RORgammaT activity. Activation of RORgammaT activity can be measured using, e.g., biochemical TR-FRET assay. I...
US Patent US10221142 (2019)
BindingDB Entry DOI: 10.7270/Q2M90BZ0