BDBM35964 E/Z ratio 3:1::cyclic compound, 14a::cyclic compound, 14a-Z
SMILES: [H][C@@]1(CO[C@@]2([H])OCC[C@@]12[H])OC(=O)N[C@@H](Cc1ccccc1)[C@H](O)CN1CCCC\C=C/CCCCOc2cc(OC)ccc2S1(=O)=O
InChI Key: InChIKey=WWNPFAANLOAHOU-HJGBNPGSSA-N
Data: 2 KI  2 EC50
Activity Spreadsheet -- Enzyme Inhibition Constant Data from BindingDB
Found 2 hits for monomerid = 35964
Trg + Lig
Ki
nM
ΔG°
kcal/mole
IC50
nM
Kd
nM
EC50/IC50
nM
koff
s-1
kon
M-1s-1
pHTemp
°C
HIV-1 Protease
(Human immunodeficiency virus type 1)
BDBM35964
(E/Z ratio 3:1 | cyclic compound, 14a | cyclic comp...)
Show SMILES [H][C@@]1(CO[C@@]2([H])OCC[C@@]12[H])OC(=O)N[C@@H](Cc1ccccc1)[C@H](O)CN1CCCC\C=C/CCCCOc2cc(OC)ccc2S1(=O)=O |r,c:34|
Show InChI InChI=1S/C34H46N2O9S/c1-41-26-15-16-32-30(22-26)42-19-12-7-5-3-2-4-6-11-18-36(46(32,39)40)23-29(37)28(21-25-13-9-8-10-14-25)35-34(38)45-31-24-44-33-27(31)17-20-43-33/h2-3,8-10,13-16,22,27-29,31,33,37H,4-7,11-12,17-21,23-24H2,1H3,(H,35,38)/b3-2-/t27-,28-,29+,31-,33+/m0/s1
0.160 -13.4n/an/a>1.00E+3n/an/a6.425
Purdue University
Assay Description
The Ki values were determined by substrate cleavage assay using fluorogenic substrate, 2-(aminobenzoyl)-Thr-Ile-Nle-Phe(p-NO2)-Gln-Arg-NH2. A standar...
J Med Chem 52: 7689-705 (2009)
Article DOI: 10.1021/jm900695w
BindingDB Entry DOI: 10.7270/Q2G44NN7
HIV-1 Protease
(Human immunodeficiency virus type 1)
BDBM35964
(E/Z ratio 3:1 | cyclic compound, 14a | cyclic comp...)
Show SMILES [H][C@@]1(CO[C@@]2([H])OCC[C@@]12[H])OC(=O)N[C@@H](Cc1ccccc1)[C@H](O)CN1CCCC\C=C/CCCCOc2cc(OC)ccc2S1(=O)=O |r,c:34|
Show InChI InChI=1S/C34H46N2O9S/c1-41-26-15-16-32-30(22-26)42-19-12-7-5-3-2-4-6-11-18-36(46(32,39)40)23-29(37)28(21-25-13-9-8-10-14-25)35-34(38)45-31-24-44-33-27(31)17-20-43-33/h2-3,8-10,13-16,22,27-29,31,33,37H,4-7,11-12,17-21,23-24H2,1H3,(H,35,38)/b3-2-/t27-,28-,29+,31-,33+/m0/s1
0.380 -12.8n/an/a 120n/an/a6.425
Purdue University
Assay Description
The Ki values were determined by substrate cleavage assay using fluorogenic substrate, 2-(aminobenzoyl)-Thr-Ile-Nle-Phe(p-NO2)-Gln-Arg-NH2. A standar...
J Med Chem 52: 7689-705 (2009)
Article DOI: 10.1021/jm900695w
BindingDB Entry DOI: 10.7270/Q2G44NN7