BDBM35965 cyclic compound, 15a
SMILES: [H][C@@]1(CO[C@@]2([H])OCC[C@@]12[H])OC(=O)N[C@@H](Cc1ccccc1)[C@H](O)CN1CCCCCCCCCCOc2cc(OC)ccc2S1(=O)=O
InChI Key: InChIKey=RMTJFBGMEPVVGM-BCQBCCTLSA-N
Data: 1 KI  1 EC50
Activity Spreadsheet -- Enzyme Inhibition Constant Data from BindingDB
Found 1 hit for monomerid = 35965
Trg + Lig
Ki
nM
ΔG°
kcal/mole
IC50
nM
Kd
nM
EC50/IC50
nM
koff
s-1
kon
M-1s-1
pHTemp
°C
HIV-1 Protease
(Human immunodeficiency virus type 1)
BDBM35965
(cyclic compound, 15a)
Show SMILES [H][C@@]1(CO[C@@]2([H])OCC[C@@]12[H])OC(=O)N[C@@H](Cc1ccccc1)[C@H](O)CN1CCCCCCCCCCOc2cc(OC)ccc2S1(=O)=O |r|
Show InChI InChI=1S/C34H48N2O9S/c1-41-26-15-16-32-30(22-26)42-19-12-7-5-3-2-4-6-11-18-36(46(32,39)40)23-29(37)28(21-25-13-9-8-10-14-25)35-34(38)45-31-24-44-33-27(31)17-20-43-33/h8-10,13-16,22,27-29,31,33,37H,2-7,11-12,17-21,23-24H2,1H3,(H,35,38)/t27-,28-,29+,31-,33+/m0/s1
0.820 -12.4n/an/a 318n/an/a6.425
Purdue University
Assay Description
The Ki values were determined by substrate cleavage assay using fluorogenic substrate, 2-(aminobenzoyl)-Thr-Ile-Nle-Phe(p-NO2)-Gln-Arg-NH2. A standar...
J Med Chem 52: 7689-705 (2009)
Article DOI: 10.1021/jm900695w
BindingDB Entry DOI: 10.7270/Q2G44NN7