null
SMILES: [H][C@@]1(CO[C@@]2([H])OCC[C@@]12[H])OC(=O)N[C@@H](Cc1ccccc1)[C@H](O)CN1C\C=C/CCCOc2cc(OC)ccc2S1(=O)=O
InChI Key: InChIKey=NYXKTTKEHKQLNH-UAZCSNRGSA-N
Activity Spreadsheet -- Enzyme Inhibition Constant Data from BindingDB
Found 1 hit for monomerid = 35972
Trg + Lig
Ki
nM
ΔG°
kcal/mole
IC50
nM
Kd
nM
EC50/IC50
nM
koff
s-1
kon
M-1s-1
pHTemp
°C
Dimer of Gag-Pol polyprotein [501-599,Q508K,L534I,L564I,C568A,C596A]
(Human immunodeficiency virus type 1)
BDBM35972
(cyclic compound, 14f)
Show SMILES [H][C@@]1(CO[C@@]2([H])OCC[C@@]12[H])OC(=O)N[C@@H](Cc1ccccc1)[C@H](O)CN1C\C=C/CCCOc2cc(OC)ccc2S1(=O)=O |r,c:31|
Show InChI InChI=1S/C30H38N2O9S/c1-37-22-11-12-28-26(18-22)38-15-8-3-2-7-14-32(42(28,35)36)19-25(33)24(17-21-9-5-4-6-10-21)31-30(34)41-27-20-40-29-23(27)13-16-39-29/h2,4-7,9-12,18,23-25,27,29,33H,3,8,13-17,19-20H2,1H3,(H,31,34)/b7-2-/t23-,24-,25+,27-,29+/m0/s1
0.0770 -13.8n/an/a 20n/an/a6.425
Purdue University
Assay Description
The Ki values were determined by substrate cleavage assay using fluorogenic substrate, 2-(aminobenzoyl)-Thr-Ile-Nle-Phe(p-NO2)-Gln-Arg-NH2. A standar...
J Med Chem 52: 7689-705 (2009)
Article DOI: 10.1021/jm900695w
BindingDB Entry DOI: 10.7270/Q2G44NN7