null
SMILES: [H][C@@]1(CO[C@@]2([H])OCC[C@@]12[H])OC(=O)N[C@@H](Cc1ccccc1)[C@H](O)CN1C\C=C/CCOc2cc(OC)ccc2S1(=O)=O
InChI Key: InChIKey=OVPADMIVRRGECP-LLFYNRROSA-N
Activity Spreadsheet -- Enzyme Inhibition Constant Data from BindingDB
Found 1 hit for monomerid = 35974
Trg + Lig
Ki
nM
ΔG°
kcal/mole
IC50
nM
Kd
nM
EC50/IC50
nM
koff
s-1
kon
M-1s-1
pHTemp
°C
Dimer of Gag-Pol polyprotein [501-599,Q508K,L534I,L564I,C568A,C596A]
(Human immunodeficiency virus type 1)
BDBM35974
(cyclic compound, 14g)
Show SMILES [H][C@@]1(CO[C@@]2([H])OCC[C@@]12[H])OC(=O)N[C@@H](Cc1ccccc1)[C@H](O)CN1C\C=C/CCOc2cc(OC)ccc2S1(=O)=O |r,c:31|
Show InChI InChI=1S/C29H36N2O9S/c1-36-21-10-11-27-25(17-21)37-14-7-3-6-13-31(41(27,34)35)18-24(32)23(16-20-8-4-2-5-9-20)30-29(33)40-26-19-39-28-22(26)12-15-38-28/h2-6,8-11,17,22-24,26,28,32H,7,12-16,18-19H2,1H3,(H,30,33)/b6-3-/t22-,23-,24+,26-,28+/m0/s1
0.0510 -14.0n/an/a 15n/an/a6.425
Purdue University
Assay Description
The Ki values were determined by substrate cleavage assay using fluorogenic substrate, 2-(aminobenzoyl)-Thr-Ile-Nle-Phe(p-NO2)-Gln-Arg-NH2. A standar...
J Med Chem 52: 7689-705 (2009)
Article DOI: 10.1021/jm900695w
BindingDB Entry DOI: 10.7270/Q2G44NN7