BDBM35975 cyclic compound, 15g
SMILES: [H][C@@]1(CO[C@@]2([H])OCC[C@@]12[H])OC(=O)N[C@@H](Cc1ccccc1)[C@H](O)CN1CCCCCOc2cc(OC)ccc2S1(=O)=O
InChI Key: InChIKey=MSAPNOBIEOSWMP-ODRUSHIJSA-N
Data: 1 KI  1 EC50
Activity Spreadsheet -- Enzyme Inhibition Constant Data from BindingDB
Found 1 hit for monomerid = 35975
Trg + Lig
Ki
nM
ΔG°
kcal/mole
IC50
nM
Kd
nM
EC50/IC50
nM
koff
s-1
kon
M-1s-1
pHTemp
°C
HIV-1 Protease
(Human immunodeficiency virus type 1)
BDBM35975
(cyclic compound, 15g)
Show SMILES [H][C@@]1(CO[C@@]2([H])OCC[C@@]12[H])OC(=O)N[C@@H](Cc1ccccc1)[C@H](O)CN1CCCCCOc2cc(OC)ccc2S1(=O)=O |r|
Show InChI InChI=1S/C29H38N2O9S/c1-36-21-10-11-27-25(17-21)37-14-7-3-6-13-31(41(27,34)35)18-24(32)23(16-20-8-4-2-5-9-20)30-29(33)40-26-19-39-28-22(26)12-15-38-28/h2,4-5,8-11,17,22-24,26,28,32H,3,6-7,12-16,18-19H2,1H3,(H,30,33)/t22-,23-,24+,26-,28+/m0/s1
0.0900 -13.7n/an/a 5.5n/an/a6.425
Purdue University
Assay Description
The Ki values were determined by substrate cleavage assay using fluorogenic substrate, 2-(aminobenzoyl)-Thr-Ile-Nle-Phe(p-NO2)-Gln-Arg-NH2. A standar...
J Med Chem 52: 7689-705 (2009)
Article DOI: 10.1021/jm900695w
BindingDB Entry DOI: 10.7270/Q2G44NN7