BDBM36126 gamma-cyclodextrin
SMILES: OC[C@H]1O[C@@H]2O[C@@H]3[C@@H](CO)O[C@H](O[C@@H]4[C@@H](CO)O[C@H](O[C@@H]5[C@@H](CO)O[C@H](O[C@@H]6[C@@H](CO)O[C@H](O[C@@H]7[C@@H](CO)O[C@H](O[C@@H]8[C@@H](CO)O[C@H](O[C@@H]9[C@@H](CO)O[C@H](O[C@H]1[C@H](O)[C@H]2O)[C@H](O)[C@H]9O)[C@H](O)[C@H]8O)[C@H](O)[C@H]7O)[C@H](O)[C@H]6O)[C@H](O)[C@H]5O)[C@H](O)[C@H]4O)[C@H](O)[C@H]3O
InChI Key: InChIKey=GDSRMADSINPKSL-HSEONFRVSA-N
Data: 53 ITC
PDB links: 3 PDB IDs match this monomer.
Activity Spreadsheet -- ITC Data from BindingDB
Found 53 hits for monomerid = 36126
Cell (A)Syringe (B)Cell
Syringe
Cell + Syr
ΔG°
kcal/mole
-TΔS°
kcal/mole
ΔH°
kcal/mole
log KpHTemp
°C
BDBM36126
JPEG
BDBM36121
JPEG
-2.713.42-6.111.996.9025
Nagoya Institute of Technology
J Am Chem Soc 126: 14224-33 (2004)
BDBM36126
JPEG
BDBM36122
JPEG
-2.183.15-5.331.606.9025
Nagoya Institute of Technology
J Am Chem Soc 126: 14224-33 (2004)
BDBM36126
JPEG
BDBM36225
JPEG
-1.894.64-6.521.386.9025
Japan Science and Technology Agency
J Org Chem 68: 5228-35 (2003)
BDBM36126
JPEG
BDBM36226
JPEG
-2.382.03-4.421.756.9025
Japan Science and Technology Agency
J Org Chem 68: 5228-35 (2003)
BDBM36126
JPEG
BDBM36227
JPEG
-2.472.01-4.471.816.9025
Japan Science and Technology Agency
J Org Chem 68: 5228-35 (2003)
BDBM36126
JPEG
BDBM36228
JPEG
-1.536.93-8.361.116.9025
Japan Science and Technology Agency
J Org Chem 68: 5228-35 (2003)
BDBM36126
JPEG
BDBM50043809
JPEG
-2.345.01-7.401.726.9025
Japan Science and Technology Agency
J Org Chem 68: 5228-35 (2003)
BDBM36126
JPEG
BDBM50043807
JPEG
-2.395.01-7.401.766.9025
Japan Science and Technology Agency
J Org Chem 68: 5228-35 (2003)
BDBM36126
JPEG
BDBM36212
JPEG
-1.890.983-2.871.386.9025
Japan Science and Technology Agency
J Org Chem 68: 5228-35 (2003)
BDBM36126
JPEG
BDBM36213
JPEG
-1.981.03-3.011.466.9025
Japan Science and Technology Agency
J Org Chem 68: 5228-35 (2003)
BDBM36126
JPEG
BDBM36214
JPEG
-2.651.17-3.821.946.9025
Japan Science and Technology Agency
J Org Chem 68: 5228-35 (2003)
BDBM36126
JPEG
BDBM36215
JPEG
-2.611.31-3.921.926.9025
Japan Science and Technology Agency
J Org Chem 68: 5228-35 (2003)
BDBM36126
JPEG
BDBM36216
JPEG
-2.120.862-2.991.566.9025
Japan Science and Technology Agency
J Org Chem 68: 5228-35 (2003)
BDBM36126
JPEG
BDBM36146
JPEG
-1.582.60-4.181.587.2025
Himeji Institute of Technology
J Am Chem Soc 115: 475-481 (1993)
BDBM36126
JPEG
BDBM36147
JPEG
-3.52-2.66-0.8602.587.2025
Himeji Institute of Technology
J Am Chem Soc 115: 475-481 (1993)
BDBM36126
JPEG
BDBM36151
JPEG
-1.794.91-6.711.317.2025
Himeji Institute of Technology
J Am Chem Soc 115: 475-481 (1993)
BDBM36126
JPEG
BDBM36254
JPEG
-5.860.833-6.694.30n/a24.9
University of Surrey
J Am Chem Soc 112: 8442-7 (1990)
BDBM36126
JPEG
BDBM36254
JPEG
-4.95-1.41-3.533.63n/a24.9
University of Surrey
J Am Chem Soc 112: 8442-7 (1990)
BDBM36126
JPEG
BDBM36255
JPEG
-5.672.65-8.314.16n/a24.9
University of Surrey
J Am Chem Soc 112: 8442-7 (1990)
BDBM36126
JPEG
BDBM36255
JPEG
-5.29-0.811-4.473.88n/a24.9
University of Surrey
J Am Chem Soc 112: 8442-7 (1990)
BDBM36126
JPEG
BDBM36256
JPEG
-4.47-2.03-2.443.28n/a24.9
University of Surrey
J Am Chem Soc 112: 8442-7 (1990)
BDBM36126
JPEG
BDBM36257
JPEG
-5.370.648-6.023.94n/a24.9
University of Surrey
J Am Chem Soc 112: 8442-7 (1990)
BDBM36126
JPEG
BDBM36257
JPEG
-5.51-0.242-5.284.04n/a24.9
University of Surrey
J Am Chem Soc 112: 8442-7 (1990)
BDBM36126
JPEG
BDBM36258
JPEG
-5.63-0.740-4.874.13n/a24.9
University of Surrey
J Am Chem Soc 112: 8442-7 (1990)
BDBM36126
JPEG
BDBM36258
JPEG
-5.66-1.94-3.734.15n/a24.9
University of Surrey
J Am Chem Soc 112: 8442-7 (1990)
BDBM36126
JPEG
BDBM36217
JPEG
-2.181.05-3.221.606.9025
Japan Science and Technology Agency
J Org Chem 68: 5228-35 (2003)
BDBM36126
JPEG
BDBM36218
JPEG
-2.481.98-4.471.826.9025
Japan Science and Technology Agency
J Org Chem 68: 5228-35 (2003)
BDBM36126
JPEG
BDBM36219
JPEG
-2.481.74-4.231.826.9025
Japan Science and Technology Agency
J Org Chem 68: 5228-35 (2003)
BDBM36126
JPEG
BDBM36220
JPEG
-2.012.17-4.181.486.9025
Japan Science and Technology Agency
J Org Chem 68: 5228-35 (2003)
BDBM36126
JPEG
BDBM36221
JPEG
-2.142.34-4.471.576.9025
Japan Science and Technology Agency
J Org Chem 68: 5228-35 (2003)
BDBM36126
JPEG
BDBM36222
JPEG
-2.482.70-5.181.826.9025
Japan Science and Technology Agency
J Org Chem 68: 5228-35 (2003)
BDBM36126
JPEG
BDBM36223
JPEG
-2.522.44-4.941.856.9025
Japan Science and Technology Agency
J Org Chem 68: 5228-35 (2003)
BDBM36126
JPEG
BDBM50043797
JPEG
-3.061.53-4.592.246.9025
Japan Science and Technology Agency
J Org Chem 68: 5228-35 (2003)
BDBM36126
JPEG
BDBM50043803
JPEG
-3.111.77-4.872.286.9025
Japan Science and Technology Agency
J Org Chem 68: 5228-35 (2003)
BDBM36126
JPEG
BDBM50043798
JPEG
-3.06-0.214-2.842.246.9025
Japan Science and Technology Agency
J Org Chem 68: 5228-35 (2003)
BDBM36126
JPEG
BDBM50043796
JPEG
-3.090.0214-3.062.276.9025
Japan Science and Technology Agency
J Org Chem 68: 5228-35 (2003)
BDBM36126
JPEG
BDBM36224
JPEG
-2.162.82-4.971.596.9025
Japan Science and Technology Agency
J Org Chem 68: 5228-35 (2003)
BDBM36126
JPEG
BDBM36229
JPEG
-2.305.01-7.311.696.9025
Japan Science and Technology Agency
J Org Chem 68: 5228-35 (2003)
BDBM36126
JPEG
BDBM36230
JPEG
-2.354.75-7.091.726.9025
Japan Science and Technology Agency
J Org Chem 68: 5228-35 (2003)
BDBM36126
JPEG
BDBM36231
JPEG
-1.659.83-11.51.206.9025
Japan Science and Technology Agency
J Org Chem 68: 5228-35 (2003)
BDBM36126
JPEG
BDBM36232
JPEG
-2.542.08-4.611.866.9025
Japan Science and Technology Agency
J Org Chem 68: 5228-35 (2003)
BDBM36126
JPEG
BDBM36233
JPEG
-1.486.45-7.881.086.9025
Japan Science and Technology Agency
J Org Chem 68: 5228-35 (2003)
BDBM36126
JPEG
BDBM36234
JPEG
-3.093.39-6.472.266.9025
Japan Science and Technology Agency
J Org Chem 68: 5228-35 (2003)
BDBM36126
JPEG
BDBM36235
JPEG
-2.432.36-4.801.786.9025
Japan Science and Technology Agency
J Org Chem 68: 5228-35 (2003)
BDBM36126
JPEG
BDBM36236
JPEG
-2.554.13-6.691.876.9025
Japan Science and Technology Agency
J Org Chem 68: 5228-35 (2003)
BDBM36126
JPEG
BDBM36237
JPEG
-1.4314.8-16.216.9025
Japan Science and Technology Agency
J Org Chem 68: 5228-35 (2003)
BDBM36126
JPEG
BDBM36238
JPEG
-2.322.41-4.731.716.9025
Japan Science and Technology Agency
J Org Chem 68: 5228-35 (2003)
BDBM36126
JPEG
BDBM36239
JPEG
-2.411.79-4.201.776.9025
Japan Science and Technology Agency
J Org Chem 68: 5228-35 (2003)
BDBM36126
JPEG
BDBM36240
JPEG
-1.983.39-5.371.466.9025
Japan Science and Technology Agency
J Org Chem 68: 5228-35 (2003)
BDBM36126
JPEG
BDBM36241
JPEG
-2.581.08-3.651.896.9025
Japan Science and Technology Agency
J Org Chem 68: 5228-35 (2003)
BDBM36126
JPEG
BDBM36242
JPEG
-2.920.142-3.052.146.9025
Japan Science and Technology Agency
J Org Chem 68: 5228-35 (2003)
BDBM36126
JPEG
BDBM36243
JPEG
-1.933.28-5.211.426.9025
Japan Science and Technology Agency
J Org Chem 68: 5228-35 (2003)
BDBM36126
JPEG
BDBM36244
JPEG
n/a7.62-11.52.81725
Doshisha University
J Org Chem 70: 3667-73 (2005)