BDBM36167 D-Trp-beta-Cyclodextrin
SMILES: OC[C@H]1O[C@@H]2O[C@@H]3[C@@H](CO)O[C@H](O[C@@H]4[C@@H](CO)O[C@H](O[C@@H]5[C@@H](CO)O[C@H](O[C@@H]6[C@@H](CN[C@H](Cc7c[nH]c8ccccc78)C(O)=O)O[C@H](O[C@@H]7[C@@H](CO)O[C@H](O[C@@H]8[C@@H](CO)O[C@H](O[C@H]1[C@H](O)[C@H]2O)[C@H](O)[C@H]8O)[C@H](O)[C@H]7O)[C@H](O)[C@H]6O)[C@H](O)[C@H]5O)[C@H](O)[C@H]4O)[C@H](O)[C@H]3O
InChI Key: InChIKey=IIWMNPUYSSMIEG-IZZAMEGCSA-N
Data: 4 ITC
Activity Spreadsheet -- ITC Data from BindingDB
Found 4 hits for monomerid = 36167
Cell (A)Syringe (B)Cell
Syringe
Cell + Syr
ΔG°
kcal/mole
-TΔS°
kcal/mole
ΔH°
kcal/mole
log KpHTemp
°C
BDBM36167
JPEG
BDBM36165
JPEG
n/a3.46-9.053.827.2025
Nankai University
J Org Chem 70: 8703-11 (2005)
BDBM36167
JPEG
BDBM36168
JPEG
n/a5.75-11.03.837.2025
Nankai University
J Org Chem 70: 8703-11 (2005)
BDBM36167
JPEG
BDBM36169
JPEG
n/a1.53-5.953.257.2025
Nankai University
J Org Chem 70: 8703-11 (2005)
BDBM36167
JPEG
BDBM36170
JPEG
n/a1.48-5.803.177.2025
Nankai University
J Org Chem 70: 8703-11 (2005)