BDBM361673 US10221177, Compound 36
SMILES: CCN(CC)c1ncc(cn1)-c1nc(NC(=O)[C@H](C)n2cnc3n(C)c(=O)n(Cc4cc(C)on4)c(=O)c23)cs1
InChI Key: InChIKey=REQIGSAIGZEBIL-HNNXBMFYSA-N
Data: 1 IC50
Activity Spreadsheet -- Enzyme Inhibition Constant Data from BindingDB
Found 1 hit for monomerid = 361673
Trg + Lig
Ki
nM
ΔG°
kcal/mole
IC50
nM
Kd
nM
EC50/IC50
nM
koff
s-1
kon
M-1s-1
pHTemp
°C
Transient receptor potential cation channel subfamily A member 1
(Homo sapiens (Human))
BDBM361673
(US10221177, Compound 36)
Show SMILES CCN(CC)c1ncc(cn1)-c1nc(NC(=O)[C@H](C)n2cnc3n(C)c(=O)n(Cc4cc(C)on4)c(=O)c23)cs1 |r|
Show InChI InChI=1S/C25H28N10O4S/c1-6-33(7-2)24-26-9-16(10-27-24)22-30-18(12-40-22)29-21(36)15(4)35-13-28-20-19(35)23(37)34(25(38)32(20)5)11-17-8-14(3)39-31-17/h8-10,12-13,15H,6-7,11H2,1-5H3,(H,29,36)/t15-/m0/s1
US Patent
n/an/a 2n/an/an/an/an/an/a
Hydra Biosciences, Inc.
US Patent
Assay Description
Compounds of Formula (I) inhibit the TRPA1 channel, as shown by measuring the in vitro inhibition of human TRPA1, provided in data tables shown in Ta...
US Patent US10221177 (2019)
BindingDB Entry DOI: 10.7270/Q2445PR8