BDBM361873 US10221177, Compound 247
SMILES: CCC(=O)Cn1c(=O)n(C)c2ncn(CC(=O)Nc3csc(n3)-c3cnc(C)c(c3)C(F)(F)F)c2c1=O
InChI Key: InChIKey=UBDMNODMLSWLJU-UHFFFAOYSA-N
Data: 1 IC50
Activity Spreadsheet -- Enzyme Inhibition Constant Data from BindingDB
Found 1 hit for monomerid = 361873
Trg + Lig
Ki
nM
ΔG°
kcal/mole
IC50
nM
Kd
nM
EC50/IC50
nM
koff
s-1
kon
M-1s-1
pHTemp
°C
Transient receptor potential cation channel subfamily A member 1
(Homo sapiens (Human))
BDBM361873
(US10221177, Compound 247)
Show SMILES CCC(=O)Cn1c(=O)n(C)c2ncn(CC(=O)Nc3csc(n3)-c3cnc(C)c(c3)C(F)(F)F)c2c1=O
Show InChI InChI=1S/C22H20F3N7O4S/c1-4-13(33)7-32-20(35)17-18(30(3)21(32)36)27-10-31(17)8-16(34)28-15-9-37-19(29-15)12-5-14(22(23,24)25)11(2)26-6-12/h5-6,9-10H,4,7-8H2,1-3H3,(H,28,34)
US Patent
n/an/a 2n/an/an/an/an/an/a
Hydra Biosciences, Inc.
US Patent
Assay Description
Compounds of Formula (I) inhibit the TRPA1 channel, as shown by measuring the in vitro inhibition of human TRPA1, provided in data tables shown in Ta...
US Patent US10221177 (2019)
BindingDB Entry DOI: 10.7270/Q2445PR8