BDBM361888 US10221177, Compound 262
SMILES: CC#CCn1c(=O)n(C)c2ncn([C@@H](C)C(=O)Nc3csc(n3)-c3ccc(nc3)N3CC4C(C3)C4(F)F)c2c1=O
InChI Key: InChIKey=CVQHMRPOOCQEKI-OOHWJJMZSA-N
Data: 1 IC50
Activity Spreadsheet -- Enzyme Inhibition Constant Data from BindingDB
Found 1 hit for monomerid = 361888
Trg + Lig
Ki
nM
ΔG°
kcal/mole
IC50
nM
Kd
nM
EC50/IC50
nM
koff
s-1
kon
M-1s-1
pHTemp
°C
Transient receptor potential cation channel subfamily A member 1
(Homo sapiens (Human))
BDBM361888
(US10221177, Compound 262)
Show SMILES CC#CCn1c(=O)n(C)c2ncn([C@@H](C)C(=O)Nc3csc(n3)-c3ccc(nc3)N3CC4C(C3)C4(F)F)c2c1=O |r|
Show InChI InChI=1S/C26H24F2N8O3S/c1-4-5-8-35-24(38)20-21(33(3)25(35)39)30-13-36(20)14(2)22(37)31-18-12-40-23(32-18)15-6-7-19(29-9-15)34-10-16-17(11-34)26(16,27)28/h6-7,9,12-14,16-17H,8,10-11H2,1-3H3,(H,31,37)/t14-,16?,17?/m0/s1
US Patent
n/an/a 1n/an/an/an/an/an/a
Hydra Biosciences, Inc.
US Patent
Assay Description
Compounds of Formula (I) inhibit the TRPA1 channel, as shown by measuring the in vitro inhibition of human TRPA1, provided in data tables shown in Ta...
US Patent US10221177 (2019)
BindingDB Entry DOI: 10.7270/Q2445PR8