BDBM36207 Bicyclo[2.2.1]heptene-1-carboxylic acid (221ene)
SMILES: OC(=O)C12CCC(C1)C=C2
InChI Key: InChIKey=LMJVDYDHTWAXDL-UHFFFAOYSA-N
Data: 7 ITC
Activity Spreadsheet -- ITC Data from BindingDB
Found 7 hits for monomerid = 36207
Cell (A)Syringe (B)Cell
Syringe
Cell + Syr
ΔG°
kcal/mole
-TΔS°
kcal/mole
ΔH°
kcal/mole
log KpHTemp
°C
BDBM4
JPEG
BDBM36207
JPEG
n/a-0.655-2.392.264.0525
University of Mississippi
J Am Chem Soc 111: 6765-72 (1989)
BDBM4
JPEG
BDBM36207
JPEG
n/a2.06-5.022.184.0525
University of Mississippi
J Am Chem Soc 111: 6765-72 (1989)
BDBM11
JPEG
BDBM36207
JPEG
n/a-1.94-1.802.758.525
University of Mississippi
J Am Chem Soc 111: 6765-72 (1989)
BDBM11
JPEG
BDBM36207
JPEG
n/a-2.54-1.802.637.2025
University of Mississippi
J Am Chem Soc 111: 6765-72 (1989)
BDBM11
JPEG
BDBM36207
JPEG
n/a0.235-5.023.514.0525
University of Mississippi
J Am Chem Soc 111: 6765-72 (1989)
BDBM4
JPEG
BDBM36207
JPEG
n/a0.150-2.391.388.525
University of Mississippi
J Am Chem Soc 111: 6765-72 (1989)
BDBM4
JPEG
BDBM36207
JPEG
n/an/a-2.011.487.2025
University of Mississippi
J Am Chem Soc 111: 6765-72 (1989)