BDBM36208 1-homoadamantanecarboxylate (1HAC)
SMILES: OC(=O)C12CC3CC(C1)CCC(C3)C2
InChI Key: InChIKey=STNYGMDZVYBFLR-UHFFFAOYSA-N
Data: 2 ITC
Activity Spreadsheet -- ITC Data from BindingDB
Found 2 hits for monomerid = 36208
Cell (A)Syringe (B)Cell
Syringe
Cell + Syr
ΔG°
kcal/mole
-TΔS°
kcal/mole
ΔH°
kcal/mole
log KpHTemp
°C
BDBM11
JPEG
BDBM36208
JPEG
n/a2.07-7.814.207.2025
University of Mississippi
J Am Chem Soc 111: 6765-72 (1989)
BDBM4
JPEG
BDBM36208
JPEG
n/a1.43-5.302.857.2025
University of Mississippi
J Am Chem Soc 111: 6765-72 (1989)