BDBM36246 2,3-DMe-beta-cyclodextrin
SMILES: CO[C@H]1[C@@H]2O[C@H](CO)[C@@H](O[C@H]3O[C@H](CO)[C@@H](O[C@H]4O[C@H](CO)[C@@H](O[C@H]5O[C@H](CO)[C@@H](O[C@H]6O[C@H](CO)[C@@H](O[C@H]7O[C@H](CO)[C@@H](O[C@H]8O[C@H](CO)[C@@H](O2)[C@H](OC)[C@H]8OC)[C@H](OC)[C@H]7OC)[C@H](OC)[C@H]6OC)[C@H](OC)[C@H]5OC)[C@H](OC)[C@H]4OC)[C@H](OC)[C@H]3OC)[C@@H]1OC
InChI Key: InChIKey=RKASCZVTBITFFN-YKIOMNDOSA-N
Data: 1 ITC
Activity Spreadsheet -- ITC Data from BindingDB
Found 1 hit for monomerid = 36246
Cell (A)Syringe (B)Cell
Syringe
Cell + Syr
ΔG°
kcal/mole
-TΔS°
kcal/mole
ΔH°
kcal/mole
log KpHTemp
°C
BDBM36246
JPEG
BDBM36244
JPEG
n/a2.63-12.26.93725
Doshisha University
J Org Chem 70: 3667-73 (2005)