null
SMILES: COc1ncc(cn1)-c1cccc2nc([C@@H]3CCCN3c3ncnc(N)c3C#N)n(-c3ccccc3)c(=O)c12
InChI Key: InChIKey=MWADXYPKNPMXFH-QFIPXVFZSA-N
Activity Spreadsheet -- Enzyme Inhibition Constant Data from BindingDB
Found 3 hits for monomerid = 362677
Trg + Lig
Ki
nM
ΔG°
kcal/mole
IC50
nM
Kd
nM
EC50/IC50
nM
koff
s-1
kon
M-1s-1
pHTemp
°C
Phosphatidylinositol 4,5-bisphosphate 3-kinase catalytic subunit alpha isoform
(Homo sapiens (Human))
BDBM362677
(US9840498, 3)
Show SMILES COc1ncc(cn1)-c1cccc2nc([C@@H]3CCCN3c3ncnc(N)c3C#N)n(-c3ccccc3)c(=O)c12 |r|
Show InChI InChI=1S/C28H23N9O2/c1-39-28-31-14-17(15-32-28)19-9-5-10-21-23(19)27(38)37(18-7-3-2-4-8-18)26(35-21)22-11-6-12-36(22)25-20(13-29)24(30)33-16-34-25/h2-5,7-10,14-16,22H,6,11-12H2,1H3,(H2,30,33,34)/t22-/m0/s1
NCI pathway
Reactome pathway
US Patent
n/an/a 1.40E+3n/an/an/an/an/an/a
Novartis AG
US Patent
Assay Description
The TR-FRET Adapta Universal Kinase Assay Kit was purchased from Invitrogen Corporation (Carlsbad/CA, USA) (Cat. No. PV5099). The kit contains the fo...
US Patent US9840498 (2017)
BindingDB Entry DOI: 10.7270/Q25X2C7X
Phosphatidylinositol 4,5-bisphosphate 3-kinase catalytic subunit gamma isoform
(Homo sapiens (Human))
BDBM362677
(US9840498, 3)
Show SMILES COc1ncc(cn1)-c1cccc2nc([C@@H]3CCCN3c3ncnc(N)c3C#N)n(-c3ccccc3)c(=O)c12 |r|
Show InChI InChI=1S/C28H23N9O2/c1-39-28-31-14-17(15-32-28)19-9-5-10-21-23(19)27(38)37(18-7-3-2-4-8-18)26(35-21)22-11-6-12-36(22)25-20(13-29)24(30)33-16-34-25/h2-5,7-10,14-16,22H,6,11-12H2,1H3,(H2,30,33,34)/t22-/m0/s1
NCI pathway
Reactome pathway
US Patent
n/an/a 1.20E+3n/an/an/an/an/an/a
Novartis AG
US Patent
Assay Description
The TR-FRET Adapta Universal Kinase Assay Kit was purchased from Invitrogen Corporation (Carlsbad/CA, USA) (Cat. No. PV5099). The kit contains the fo...
US Patent US9840498 (2017)
BindingDB Entry DOI: 10.7270/Q25X2C7X
Phosphatidylinositol 4,5-bisphosphate 3-kinase catalytic subunit delta isoform
(Homo sapiens (Human))
BDBM362677
(US9840498, 3)
Show SMILES COc1ncc(cn1)-c1cccc2nc([C@@H]3CCCN3c3ncnc(N)c3C#N)n(-c3ccccc3)c(=O)c12 |r|
Show InChI InChI=1S/C28H23N9O2/c1-39-28-31-14-17(15-32-28)19-9-5-10-21-23(19)27(38)37(18-7-3-2-4-8-18)26(35-21)22-11-6-12-36(22)25-20(13-29)24(30)33-16-34-25/h2-5,7-10,14-16,22H,6,11-12H2,1H3,(H2,30,33,34)/t22-/m0/s1
NCI pathway
Reactome pathway
US Patent
n/an/a 8n/an/an/an/an/an/a
Novartis AG
US Patent
Assay Description
The TR-FRET Adapta Universal Kinase Assay Kit was purchased from Invitrogen Corporation (Carlsbad/CA, USA) (Cat. No. PV5099). The kit contains the fo...
US Patent US9840498 (2017)
BindingDB Entry DOI: 10.7270/Q25X2C7X