BDBM362695 US9840498, 21
SMILES: COc1ccc(cn1)-c1cccc2nc([C@@H]3CCCN3c3nc(N)nc(C)c3C#N)n(-c3ccccc3)c(=O)c12
InChI Key: InChIKey=NTDZGRPARIXUKZ-DEOSSOPVSA-N
Data: 3 IC50
Activity Spreadsheet -- Enzyme Inhibition Constant Data from BindingDB
Found 3 hits for monomerid = 362695
Trg + Lig
Ki
nM
ΔG°
kcal/mole
IC50
nM
Kd
nM
EC50/IC50
nM
koff
s-1
kon
M-1s-1
pHTemp
°C
Phosphatidylinositol 4,5-bisphosphate 3-kinase catalytic subunit alpha isoform
(Homo sapiens (Human))
BDBM362695
(US9840498, 21)
Show SMILES COc1ccc(cn1)-c1cccc2nc([C@@H]3CCCN3c3nc(N)nc(C)c3C#N)n(-c3ccccc3)c(=O)c12 |r|
Show InChI InChI=1S/C30H26N8O2/c1-18-22(16-31)27(36-30(32)34-18)37-15-7-12-24(37)28-35-23-11-6-10-21(19-13-14-25(40-2)33-17-19)26(23)29(39)38(28)20-8-4-3-5-9-20/h3-6,8-11,13-14,17,24H,7,12,15H2,1-2H3,(H2,32,34,36)/t24-/m0/s1
NCI pathway
Reactome pathway
US Patent
n/an/a 260n/an/an/an/an/an/a
Novartis AG
US Patent
Assay Description
The TR-FRET Adapta Universal Kinase Assay Kit was purchased from Invitrogen Corporation (Carlsbad/CA, USA) (Cat. No. PV5099). The kit contains the fo...
US Patent US9840498 (2017)
BindingDB Entry DOI: 10.7270/Q25X2C7X
Phosphatidylinositol 4,5-bisphosphate 3-kinase catalytic subunit gamma isoform
(Homo sapiens (Human))
BDBM362695
(US9840498, 21)
Show SMILES COc1ccc(cn1)-c1cccc2nc([C@@H]3CCCN3c3nc(N)nc(C)c3C#N)n(-c3ccccc3)c(=O)c12 |r|
Show InChI InChI=1S/C30H26N8O2/c1-18-22(16-31)27(36-30(32)34-18)37-15-7-12-24(37)28-35-23-11-6-10-21(19-13-14-25(40-2)33-17-19)26(23)29(39)38(28)20-8-4-3-5-9-20/h3-6,8-11,13-14,17,24H,7,12,15H2,1-2H3,(H2,32,34,36)/t24-/m0/s1
NCI pathway
Reactome pathway
US Patent
n/an/a 270n/an/an/an/an/an/a
Novartis AG
US Patent
Assay Description
The TR-FRET Adapta Universal Kinase Assay Kit was purchased from Invitrogen Corporation (Carlsbad/CA, USA) (Cat. No. PV5099). The kit contains the fo...
US Patent US9840498 (2017)
BindingDB Entry DOI: 10.7270/Q25X2C7X
Phosphatidylinositol 4,5-bisphosphate 3-kinase catalytic subunit delta isoform
(Homo sapiens (Human))
BDBM362695
(US9840498, 21)
Show SMILES COc1ccc(cn1)-c1cccc2nc([C@@H]3CCCN3c3nc(N)nc(C)c3C#N)n(-c3ccccc3)c(=O)c12 |r|
Show InChI InChI=1S/C30H26N8O2/c1-18-22(16-31)27(36-30(32)34-18)37-15-7-12-24(37)28-35-23-11-6-10-21(19-13-14-25(40-2)33-17-19)26(23)29(39)38(28)20-8-4-3-5-9-20/h3-6,8-11,13-14,17,24H,7,12,15H2,1-2H3,(H2,32,34,36)/t24-/m0/s1
NCI pathway
Reactome pathway
US Patent
n/an/a 24n/an/an/an/an/an/a
Novartis AG
US Patent
Assay Description
The TR-FRET Adapta Universal Kinase Assay Kit was purchased from Invitrogen Corporation (Carlsbad/CA, USA) (Cat. No. PV5099). The kit contains the fo...
US Patent US9840498 (2017)
BindingDB Entry DOI: 10.7270/Q25X2C7X