BDBM36281 BDBM197279::cucurbit[7]uril
SMILES: O=C1N2CN3[C@@H]4[C@@H]5N(CN6[C@@H]7[C@@H]8N(CN9[C@@H]%10[C@@H]%11N(CN%12[C@@H]%13[C@@H]%14N(CN%15[C@@H]%16[C@@H]%17N(CN%18[C@@H]%19[C@@H]%20N(CN1[C@@H]1[C@H]2N2CN4C(=O)N5CN7C(=O)N8CN%10C(=O)N%11CN%13C(=O)N%14CN%16C(=O)N%17CN%19C(=O)N%20CN1C2=O)C%18=O)C%15=O)C%12=O)C9=O)C6=O)C3=O
InChI Key: InChIKey=ZDOBFUIMGBWEAB-UHFFFAOYSA-N
Data: 20 ITC
PDB links: 11 PDB IDs match this monomer.
Activity Spreadsheet -- ITC Data from BindingDB
Found 20 hits for monomerid = 36281
Cell (A)Syringe (B)Cell
Syringe
Cell + Syr
ΔG°
kcal/mole
-TΔS°
kcal/mole
ΔH°
kcal/mole
log KpHTemp
°C
BDBM36281
JPEG
BDBM36311
JPEG
-5.21-3.30-1.903.82727
University of Cambridge
Chemistry 16: 13716-22 (2010)
BDBM36281
JPEG
BDBM36282
JPEG
n/a8.12-21.09.48n/a25
University of Miami
J Am Chem Soc 127: 12984-9 (2005)
BDBM36281
JPEG
BDBM36283
JPEG
n/a4.30-21.012.3n/a25
University of Miami
J Am Chem Soc 127: 12984-9 (2005)
BDBM36281
JPEG
BDBM36259
JPEG
n/a4.06-21.312.6n/a25
University of Miami
J Am Chem Soc 127: 12984-9 (2005)
BDBM36281
JPEG
BDBM197288
JPEG
-9.79n/an/a7.237.4024.9
University of California San Diego
J Comput Aided Mol Des 28: 305-17 (2014)
BDBM36281
JPEG
BDBM197289
JPEG
-9.55n/an/a7.047.4024.9
University of California San Diego
J Comput Aided Mol Des 28: 305-17 (2014)
BDBM36281
JPEG
BDBM197290
JPEG
-6.69n/an/a4.857.4024.9
University of California San Diego
J Comput Aided Mol Des 28: 305-17 (2014)
BDBM36281
JPEG
BDBM197291
JPEG
-8.36n/an/a6.187.4024.9
University of California San Diego
J Comput Aided Mol Des 28: 305-17 (2014)
BDBM36281
JPEG
BDBM197292
JPEG
-8.60n/an/a6.267.4024.9
University of California San Diego
J Comput Aided Mol Des 28: 305-17 (2014)
BDBM36281
JPEG
BDBM197293
JPEG
-7.88n/an/a5.817.4024.9
University of California San Diego
J Comput Aided Mol Des 28: 305-17 (2014)
BDBM36281
JPEG
BDBM197294
JPEG
-10.1n/an/a7.387.4024.9
University of California San Diego
J Comput Aided Mol Des 28: 305-17 (2014)
BDBM36281
JPEG
BDBM197295
JPEG
-11.8n/an/a8.667.4024.9
University of California San Diego
J Comput Aided Mol Des 28: 305-17 (2014)
BDBM36281
JPEG
BDBM197296
JPEG
-12.6n/an/a8.267.4024.9
University of California San Diego
J Comput Aided Mol Des 28: 305-17 (2014)
BDBM36281
JPEG
BDBM197297
JPEG
-7.88n/an/a5.767.4024.9
University of California San Diego
J Comput Aided Mol Des 28: 305-17 (2014)
BDBM36281
JPEG
BDBM197298
JPEG
-11.1n/an/a8.117.4024.9
University of California San Diego
J Comput Aided Mol Des 28: 305-17 (2014)
BDBM36281
JPEG
BDBM197299
JPEG
-13.3n/an/an/a7.4024.9
University of California San Diego
J Comput Aided Mol Des 28: 305-17 (2014)
BDBM36281
JPEG
BDBM197300
JPEG
-14.1n/an/an/a7.4024.9
University of California San Diego
J Comput Aided Mol Des 28: 305-17 (2014)
BDBM36281
JPEG
BDBM197301
JPEG
-11.6n/an/a8.497.4024.9
University of California San Diego
J Comput Aided Mol Des 28: 305-17 (2014)
BDBM36281
JPEG
BDBM197285
JPEG
-6.112.36-8.604.46726.9
University of California San Diego
J Comput Aided Mol Des 26: 475-87 (2012)
BDBM36281
JPEG
BDBM197286
JPEG
-7.43-3.58-3.825.41726.9
University of California San Diego
J Comput Aided Mol Des 26: 475-87 (2012)