BDBM36285 2,6-dihdroxynaphthalene::2,6-dihydroxynaphthalene
SMILES: Oc1ccc2cc(O)ccc2c1
InChI Key: InChIKey=MNZMMCVIXORAQL-UHFFFAOYSA-N
Data: 2 ITC
Activity Spreadsheet -- ITC Data from BindingDB
Found 2 hits for monomerid = 36285
Cell (A)Syringe (B)Cell
Syringe
Cell + Syr
ΔG°
kcal/mole
-TΔS°
kcal/mole
ΔH°
kcal/mole
log KpHTemp
°C
BDBM36284
JPEG
BDBM36285
JPEG
-6.596.98-13.64.86725
University of Cambridge
Chemistry 16: 13716-22 (2010)
BDBM36284
JPEG
BDBM36285
JPEG
-7.86n/an/a5.77725
University of Cambridge
J Phys Chem B 114: 8606-15 (2010)