BDBM36290 2,3-dihydroxynaphthalene
SMILES: Oc1cc2ccccc2cc1O
InChI Key: InChIKey=JRNGUTKWMSBIBF-UHFFFAOYSA-N
Data: 1 ITC
PDB links: 10 PDB IDs match this monomer.
Activity Spreadsheet -- ITC Data from BindingDB
Found 1 hit for monomerid = 36290
Cell (A)Syringe (B)Cell
Syringe
Cell + Syr
ΔG°
kcal/mole
-TΔS°
kcal/mole
ΔH°
kcal/mole
log KpHTemp
°C
BDBM36284
JPEG
BDBM36290
JPEG
-7.50n/an/a5.51725
University of Cambridge
J Phys Chem B 114: 8606-15 (2010)