BDBM36296 3-methoxy-2-naphthol
SMILES: COc1cc2ccccc2cc1O
InChI Key: InChIKey=SJTNTIRIRIPZDV-UHFFFAOYSA-N
Data: 1 ITC
Activity Spreadsheet -- ITC Data from BindingDB
Found 1 hit for monomerid = 36296
Cell (A)Syringe (B)Cell
Syringe
Cell + Syr
ΔG°
kcal/mole
-TΔS°
kcal/mole
ΔH°
kcal/mole
log KpHTemp
°C
BDBM36284
JPEG
BDBM36296
JPEG
-7.09n/an/a5.20725
University of Cambridge
J Phys Chem B 114: 8606-15 (2010)