null
SMILES: Oc1ccccc1C#N
InChI Key: InChIKey=CHZCERSEMVWNHL-UHFFFAOYSA-N
PDB links: 4 PDB IDs match this monomer.
Activity Spreadsheet -- ITC Data from BindingDB
Found 1 hit for monomerid = 36298
Cell (A)Syringe (B)Cell
Syringe
Cell + Syr
ΔG°
kcal/mole
-TΔS°
kcal/mole
ΔH°
kcal/mole
log KpHTemp
°C
BDBM36284
JPEG
BDBM36298
JPEG
-4.48n/an/a3.28725
University of Cambridge
J Phys Chem B 114: 8606-15 (2010)