BDBM36300 4-iodophenol
SMILES: Oc1ccc(I)cc1
InChI Key: InChIKey=VSMDINRNYYEDRN-UHFFFAOYSA-N
Data: 2 ITC
PDB links: 3 PDB IDs match this monomer.
Activity Spreadsheet -- ITC Data from BindingDB
Found 2 hits for monomerid = 36300
Cell (A)Syringe (B)Cell
Syringe
Cell + Syr
ΔG°
kcal/mole
-TΔS°
kcal/mole
ΔH°
kcal/mole
log KpHTemp
°C
BDBM36284
JPEG
BDBM36300
JPEG
-5.025.98-11.03.61725
University of Cambridge
Chemistry 16: 13716-22 (2010)
BDBM36284
JPEG
BDBM36300
JPEG
-5.61n/an/a4.11725
University of Cambridge
J Phys Chem B 114: 8606-15 (2010)