BDBM36315 5-fluoro-indolyl- 2'-deoxyriboside triphosphate::d5-FITP
SMILES: [H][C@]1(O)C[C@@]([H])(O[C@]1([H])COP(O)(=O)OP(O)(=O)OP(O)(O)=O)n1ccc2cc(F)ccc12
InChI Key: InChIKey=HOKREAXPXGANMQ-YNEHKIRRSA-N
Data: 2 KI
Activity Spreadsheet -- Enzyme Inhibition Constant Data from BindingDB
Found 2 hits for monomerid = 36315
Trg + Lig
Ki
nM
ΔG°
kcal/mole
IC50
nM
Kd
nM
EC50/IC50
nM
koff
s-1
kon
M-1s-1
pHTemp
°C
DNA polymerase III subunit gamma
(Escherichia coli)
BDBM36315
(5-fluoro-indolyl- 2'-deoxyriboside triphosphat...)
Show SMILES [H][C@]1(O)C[C@@]([H])(O[C@]1([H])COP(O)(=O)OP(O)(=O)OP(O)(O)=O)n1ccc2cc(F)ccc12
Show InChI InChI=1S/C13H17FNO12P3/c14-9-1-2-10-8(5-9)3-4-15(10)13-6-11(16)12(25-13)7-24-29(20,21)27-30(22,23)26-28(17,18)19/h1-5,11-13,16H,6-7H2,(H,20,21)(H,22,23)(H2,17,18,19)/t11-,12+,13+/m0/s1
3.40E+4 -6.34n/an/an/an/an/a7.537
Case Western Reserve University
Assay Description
ATPase assay contained 10 mM Mg2+, 1uM 13/20 DNA, 500uM (r)NTP or (d)NTP, 500 nM gp45, and 500 nM gp44/62 in T4 buffer. ATPase activity was measured ...
ACS Chem Biol 5: 183-94 (2010)
Article DOI: 10.1021/cb900218c
BindingDB Entry DOI: 10.7270/Q26M356K
ATP-dependent clamp loaders gp44/62
(Enterobacteria phage T4 (Bacteriophage T4))
BDBM36315
(5-fluoro-indolyl- 2'-deoxyriboside triphosphat...)
Show SMILES [H][C@]1(O)C[C@@]([H])(O[C@]1([H])COP(O)(=O)OP(O)(=O)OP(O)(O)=O)n1ccc2cc(F)ccc12
Show InChI InChI=1S/C13H17FNO12P3/c14-9-1-2-10-8(5-9)3-4-15(10)13-6-11(16)12(25-13)7-24-29(20,21)27-30(22,23)26-28(17,18)19/h1-5,11-13,16H,6-7H2,(H,20,21)(H,22,23)(H2,17,18,19)/t11-,12+,13+/m0/s1
<2.00E+5<-5.04n/an/an/an/an/a7.525
Case Western Reserve University
Assay Description
ATPase assay contained 10 mM Mg2+, 1uM 13/20 DNA, 500uM (r)NTP or (d)NTP, 500 nM gp45, and 500 nM gp44/62 in T4 buffer. ATPase activity was measured ...
ACS Chem Biol 5: 183-94 (2010)
Article DOI: 10.1021/cb900218c
BindingDB Entry DOI: 10.7270/Q26M356K