BDBM36332 LI-1::Legumain Inhibitor -1
SMILES: CCOC(=O)[C@H]1O[C@@H]1C(=O)N(CC(N)=O)NC(=O)[C@@H]1CCCN1C(C)=O
InChI Key: InChIKey=TZKVALJHLJILLI-DLOVCJGASA-N
Data: 5 IC50
Activity Spreadsheet -- Enzyme Inhibition Constant Data from BindingDB
Found 5 hits for monomerid = 36332
Trg + Lig
Ki
nM
ΔG°
kcal/mole
IC50
nM
Kd
nM
EC50/IC50
nM
koff
s-1
kon
M-1s-1
pHTemp
°C
Legumain
(Mus musculus)
BDBM36332
(LI-1 | Legumain Inhibitor -1)
Show SMILES CCOC(=O)[C@H]1O[C@@H]1C(=O)N(CC(N)=O)NC(=O)[C@@H]1CCCN1C(C)=O |r|
Show InChI InChI=1S/C15H22N4O7/c1-3-25-15(24)12-11(26-12)14(23)19(7-10(16)21)17-13(22)9-5-4-6-18(9)8(2)20/h9,11-12H,3-7H2,1-2H3,(H2,16,21)(H,17,22)/t9-,11-,12-/m0/s1
Reactome pathway
n/an/a 11.5n/an/an/an/a5.825
Stanford University
Assay Description
IC50 measurements and enzyme kinetics assays were performed on a Spectramax M5 fluorescent plate reader (Molecular Devices).
ACS Chem Biol 5: 233-43 (2010)
Article DOI: 10.1021/cb900232a
BindingDB Entry DOI: 10.7270/Q2Z31X0W
Cathepsin B
(Mus musculus)
BDBM36332
(LI-1 | Legumain Inhibitor -1)
Show SMILES CCOC(=O)[C@H]1O[C@@H]1C(=O)N(CC(N)=O)NC(=O)[C@@H]1CCCN1C(C)=O |r|
Show InChI InChI=1S/C15H22N4O7/c1-3-25-15(24)12-11(26-12)14(23)19(7-10(16)21)17-13(22)9-5-4-6-18(9)8(2)20/h9,11-12H,3-7H2,1-2H3,(H2,16,21)(H,17,22)/t9-,11-,12-/m0/s1
Reactome pathway
n/an/a 3.90E+5n/an/an/an/a6.2525
Stanford University
Assay Description
IC50 measurements and enzyme kinetics assays were performed on a Spectramax M5 fluorescent plate reader (Molecular Devices).
ACS Chem Biol 5: 233-43 (2010)
Article DOI: 10.1021/cb900232a
BindingDB Entry DOI: 10.7270/Q2Z31X0W
Legumain
(Mus musculus)
BDBM36332
(LI-1 | Legumain Inhibitor -1)
Show SMILES CCOC(=O)[C@H]1O[C@@H]1C(=O)N(CC(N)=O)NC(=O)[C@@H]1CCCN1C(C)=O |r|
Show InChI InChI=1S/C15H22N4O7/c1-3-25-15(24)12-11(26-12)14(23)19(7-10(16)21)17-13(22)9-5-4-6-18(9)8(2)20/h9,11-12H,3-7H2,1-2H3,(H2,16,21)(H,17,22)/t9-,11-,12-/m0/s1
Reactome pathway
n/an/a 9.30n/an/an/an/an/an/a
Stanford University School of Medicine
Curated by ChEMBL
Assay Description
Inhibition of mouse recombinant legumain using Cbz-Ala-Ala-Asn-AMC as substrate measured every 30 secs for 2.5 hrs by fluorimetry
Bioorg Med Chem Lett 22: 1340-3 (2012)
Article DOI: 10.1016/j.bmcl.2011.12.079
BindingDB Entry DOI: 10.7270/Q2H132GV
Caspase-3
(Mus musculus)
BDBM36332
(LI-1 | Legumain Inhibitor -1)
Show SMILES CCOC(=O)[C@H]1O[C@@H]1C(=O)N(CC(N)=O)NC(=O)[C@@H]1CCCN1C(C)=O |r|
Show InChI InChI=1S/C15H22N4O7/c1-3-25-15(24)12-11(26-12)14(23)19(7-10(16)21)17-13(22)9-5-4-6-18(9)8(2)20/h9,11-12H,3-7H2,1-2H3,(H2,16,21)(H,17,22)/t9-,11-,12-/m0/s1
Reactome pathway
n/an/a 8.90E+5n/an/an/an/a7.425
Stanford University
Assay Description
IC50 measurements and enzyme kinetics assays were performed on a Spectramax M5 fluorescent plate reader (Molecular Devices).
ACS Chem Biol 5: 233-43 (2010)
Article DOI: 10.1021/cb900232a
BindingDB Entry DOI: 10.7270/Q2Z31X0W
Cathepsin L
(Mus musculus)
BDBM36332
(LI-1 | Legumain Inhibitor -1)
Show SMILES CCOC(=O)[C@H]1O[C@@H]1C(=O)N(CC(N)=O)NC(=O)[C@@H]1CCCN1C(C)=O |r|
Show InChI InChI=1S/C15H22N4O7/c1-3-25-15(24)12-11(26-12)14(23)19(7-10(16)21)17-13(22)9-5-4-6-18(9)8(2)20/h9,11-12H,3-7H2,1-2H3,(H2,16,21)(H,17,22)/t9-,11-,12-/m0/s1
Reactome pathway
n/an/a 2.20E+5n/an/an/an/a6.2525
Stanford University
Assay Description
IC50 measurements and enzyme kinetics assays were performed on a Spectramax M5 fluorescent plate reader (Molecular Devices).
ACS Chem Biol 5: 233-43 (2010)
Article DOI: 10.1021/cb900232a
BindingDB Entry DOI: 10.7270/Q2Z31X0W