null
SMILES: O=c1c(c[nH]n1-c1cc(ncn1)N1CCCCC1)-c1cncc(c1)C#N
InChI Key: InChIKey=NQVNDFRNCUPOKR-UHFFFAOYSA-N
Activity Spreadsheet -- Enzyme Inhibition Constant Data from BindingDB
Found 1 hit for monomerid = 3643
Trg + Lig
Ki
nM
ΔG°
kcal/mole
IC50
nM
Kd
nM
EC50/IC50
nM
koff
s-1
kon
M-1s-1
pHTemp
°C
Transmembrane prolyl 4-hydroxylase
(Homo sapiens (Human))
BDBM3643
(US8524699, 44)
Show SMILES O=c1c(c[nH]n1-c1cc(ncn1)N1CCCCC1)-c1cncc(c1)C#N
Show InChI InChI=1S/C18H17N7O/c19-8-13-6-14(10-20-9-13)15-11-23-25(18(15)26)17-7-16(21-12-22-17)24-4-2-1-3-5-24/h6-7,9-12,23H,1-5H2
US Patent
n/an/a 1.12E+3n/an/an/an/a7.525
Bayer Intellectual Property GmbH
US Patent
Assay Description
In Vitro assay determination of the activity and selectivity of HIF Prolyl 4-hydroxylase inhibitors.
US Patent US8524699 (2013)
BindingDB Entry DOI: 10.7270/Q2TB15J4