BDBM3648 3-({4-[(3-bromophenyl)amino]pyrido[4,3-d]pyrimidin-7-yl}amino)propane-1,2-diol::4-[(3-Bromophenyl)amino]-7-[(2,3-dihydroxypropyl)-amino]pyrido[4,3-d]pyrimidine::pyrido[4,3-d]pyrimidine deriv. 3f
SMILES: OCC(O)CNc1cc2ncnc(Nc3cccc(Br)c3)c2cn1
InChI Key: InChIKey=JLXPNVOGDZTOJF-UHFFFAOYSA-N
Data: 1 IC50
Activity Spreadsheet -- Enzyme Inhibition Constant Data from BindingDB
Found 1 hit for monomerid = 3648
Trg + Lig
Ki
nM
ΔG°
kcal/mole
IC50
nM
Kd
nM
EC50/IC50
nM
koff
s-1
kon
M-1s-1
pHTemp
°C
Epidermal growth factor receptor
(Homo sapiens (Human))
BDBM3648
(3-({4-[(3-bromophenyl)amino]pyrido[4,3-d]pyrimidin...)
Show SMILES OCC(O)CNc1cc2ncnc(Nc3cccc(Br)c3)c2cn1
Show InChI InChI=1S/C16H16BrN5O2/c17-10-2-1-3-11(4-10)22-16-13-7-19-15(18-6-12(24)8-23)5-14(13)20-9-21-16/h1-5,7,9,12,23-24H,6,8H2,(H,18,19)(H,20,21,22)
n/an/a 0.920n/an/an/an/a7.425
University of Auckland
Assay Description
IC50 is the inhibitor concentration which inhibits 50% of kinase activity that catalyzes the transfer of the terminal phosphate from [gamma-32P] labe...
J Med Chem 40: 3915-25 (1997)
Article DOI: 10.1021/jm970366v
BindingDB Entry DOI: 10.7270/Q2NS0S2V