BDBM36502 2-(6-Methoxybenzofuran-3-yl)acetic acid, 3::CID736818
SMILES: COc1ccc2c(CC(O)=O)coc2c1
InChI Key: InChIKey=QCXJFLREQGIACT-UHFFFAOYSA-N
Data: 2 IC50
PDB links: 2 PDB IDs match this monomer.
Activity Spreadsheet -- Enzyme Inhibition Constant Data from BindingDB
Found 2 hits for monomerid = 36502
Trg + Lig
Ki
nM
ΔG°
kcal/mole
IC50
nM
Kd
nM
EC50/IC50
nM
koff
s-1
kon
M-1s-1
pHTemp
°C
Farnesyl diphosphate synthase
(Homo sapiens (Human))
BDBM36502
(2-(6-Methoxybenzofuran-3-yl)acetic acid, 3 | CID73...)
Show SMILES COc1ccc2c(CC(O)=O)coc2c1
Show InChI InChI=1S/C11H10O4/c1-14-8-2-3-9-7(4-11(12)13)6-15-10(9)5-8/h2-3,5-6H,4H2,1H3,(H,12,13)
Reactome pathway
n/an/a>5.00E+8n/an/an/an/an/an/a
Institut de Chimie des Substances Naturelles
Curated by ChEMBL
Assay Description
Inhibition of FPPS (unknown origin)
Bioorg Med Chem 22: 4474-89 (2014)
Article DOI: 10.1016/j.bmc.2014.04.019
BindingDB Entry DOI: 10.7270/Q29K4CW0
3D
3D Structure (crystal)
Farnesyl diphosphate synthase
(Homo sapiens (Human))
BDBM36502
(2-(6-Methoxybenzofuran-3-yl)acetic acid, 3 | CID73...)
Show SMILES COc1ccc2c(CC(O)=O)coc2c1
Show InChI InChI=1S/C11H10O4/c1-14-8-2-3-9-7(4-11(12)13)6-15-10(9)5-8/h2-3,5-6H,4H2,1H3,(H,12,13)
Reactome pathway
n/an/a>5.00E+5n/an/an/an/a7.423
Novartis Institutes for Biomedical Research
Assay Description
A biophysical assay using NMR spectroscopy to identify fragments with higher binding affinity to human recombinant FPPS.
Nat Chem Biol 6: 660-6 (2010)
Article DOI: 10.1038/nchembio.421
BindingDB Entry DOI: 10.7270/Q2KP80HJ
3D
3D Structure (crystal)