BDBM36514 CID46912122::MDW933, 5
SMILES: CC1=CC(C)=[N+]2C1=C(CCCCc1cn(C[C@H]3[C@H]4O[C@H]4[C@H](O)[C@@H](O)[C@@H]3O)nn1)c1c(C)cc(C)n1[B-]2(F)F
InChI Key: InChIKey=IZGBBUJVVVRRFK-DQTYAKANSA-N
Data: 1 KI  1 IC50
Activity Spreadsheet -- Enzyme Inhibition Constant Data from BindingDB
Found 1 hit for monomerid = 36514
Trg + Lig
Ki
nM
ΔG°
kcal/mole
IC50
nM
Kd
nM
EC50/IC50
nM
koff
s-1
kon
M-1s-1
pHTemp
°C
Lysosomal acid glucosylceramidase
(Homo sapiens (Human))
BDBM36514
(CID46912122 | MDW933, 5)
Show SMILES CC1=CC(C)=[N+]2C1=C(CCCCc1cn(C[C@H]3[C@H]4O[C@H]4[C@H](O)[C@@H](O)[C@@H]3O)nn1)c1c(C)cc(C)n1[B-]2(F)F |c:4,7,t:1|
Show InChI InChI=1S/C26H34BF2N5O4/c1-13-9-15(3)33-20(13)18(21-14(2)10-16(4)34(21)27(33,28)29)8-6-5-7-17-11-32(31-30-17)12-19-22(35)23(36)24(37)26-25(19)38-26/h9-11,19,22-26,35-37H,5-8,12H2,1-4H3/t19-,22-,23+,24-,25-,26+/m1/s1
Reactome pathway
7 -11.6 1.24n/an/an/an/a5.237
Leiden University
Assay Description
Enzymatic activity assay using fluorescent activity-based labeling method.
Nat Chem Biol 6: 907-13 (2010)
Article DOI: 10.1038/nchembio.466
BindingDB Entry DOI: 10.7270/Q2FX77ST