BDBM36540 5-bromo-2-phenoxylphenol::PT103
SMILES: Oc1cc(Br)ccc1Oc1ccccc1
InChI Key: InChIKey=FRSXJIRAHQYJQB-UHFFFAOYSA-N
Data: 3 KI
Activity Spreadsheet -- Enzyme Inhibition Constant Data from BindingDB
Found 3 hits for monomerid = 36540
Trg + Lig
Ki
nM
ΔG°
kcal/mole
IC50
nM
Kd
nM
EC50/IC50
nM
koff
s-1
kon
M-1s-1
pHTemp
°C
Enoyl-ACP Reductase (FabI)
(Staphylococcus aureus)
BDBM36540
(5-bromo-2-phenoxylphenol | PT103)
Show SMILES Oc1cc(Br)ccc1Oc1ccccc1
Show InChI InChI=1S/C12H9BrO2/c13-9-6-7-12(11(14)8-9)15-10-4-2-1-3-5-10/h1-8,14H
0.0600n/an/an/an/an/an/a7.5n/a
Stony Brook University
Assay Description
ThermoFluor experiments were carried out in 96-well plates (Concord) using the CFX96 RealTime PCR Detection system and C1000 Thermal Cycler (BioRad).
Biochemistry 52: 4217-28 (2013)
Article DOI: 10.1021/bi400413c
BindingDB Entry DOI: 10.7270/Q2610XZJ
Enoyl-[acyl-carrier-protein] reductase [NADH] (ftuFabl)
(Francisella tularensis)
BDBM36540
(5-bromo-2-phenoxylphenol | PT103)
Show SMILES Oc1cc(Br)ccc1Oc1ccccc1
Show InChI InChI=1S/C12H9BrO2/c13-9-6-7-12(11(14)8-9)15-10-4-2-1-3-5-10/h1-8,14H
7.10 -11.1n/an/an/an/an/a8.025
Stony Brook University
Assay Description
Inhibition constant binding to E-NAD+
ACS Chem Biol 4: 221-31 (2009)
Article DOI: 10.1021/cb800306y
BindingDB Entry DOI: 10.7270/Q2T72FTC
Enoyl-[acyl-carrier-protein] reductase [NADH] (ftuFabl)
(Francisella tularensis)
BDBM36540
(5-bromo-2-phenoxylphenol | PT103)
Show SMILES Oc1cc(Br)ccc1Oc1ccccc1
Show InChI InChI=1S/C12H9BrO2/c13-9-6-7-12(11(14)8-9)15-10-4-2-1-3-5-10/h1-8,14H
149 -9.31n/an/an/an/an/a8.025
Stony Brook University
Assay Description
Inhibition constant binding to E-NADH
ACS Chem Biol 4: 221-31 (2009)
Article DOI: 10.1021/cb800306y
BindingDB Entry DOI: 10.7270/Q2T72FTC