null
SMILES: CC(C)Oc1cc(CNC(=O)c2cccn(Cc3ccc(F)c(F)c3)c2=O)cc(c1)-c1c[nH]c2ncccc12
InChI Key: InChIKey=QOBJISFQPVSAQW-UHFFFAOYSA-N
Activity Spreadsheet -- Enzyme Inhibition Constant Data from BindingDB
Found 1 hit for monomerid = 366102
Trg + Lig
Ki
nM
ΔG°
kcal/mole
IC50
nM
Kd
nM
EC50/IC50
nM
koff
s-1
kon
M-1s-1
pHTemp
°C
3-phosphoinositide-dependent protein kinase 1 [51-360]
(Homo sapiens (Human))
BDBM366102
(US9873693, Compound 25)
Show SMILES CC(C)Oc1cc(CNC(=O)c2cccn(Cc3ccc(F)c(F)c3)c2=O)cc(c1)-c1c[nH]c2ncccc12
Show InChI InChI=1S/C30H26F2N4O3/c1-18(2)39-22-12-20(11-21(14-22)25-16-34-28-23(25)5-3-9-33-28)15-35-29(37)24-6-4-10-36(30(24)38)17-19-7-8-26(31)27(32)13-19/h3-14,16,18H,15,17H2,1-2H3,(H,33,34)(H,35,37)
US Patent
n/an/a<500n/an/an/an/an/an/a
Duquesne University
Assay Description
A PDK1 kinase assay was performed as follows. PDK1 (amino acids 51-360) and AKT2 (amino acids 140-467 fused to PIFtide, amino acids EEQEMFRDFDYIADW) ...
J Med Chem 51: 68-76 (2008)
BindingDB Entry DOI: 10.7270/Q2H41TRT