null
SMILES: Fc1ccc(cc1)C(COc1ccc2[nH]c(=O)[nH]c2c1)NC(=O)c1cccn(Cc2ccc(F)c(F)c2)c1=O
InChI Key: InChIKey=ARFWUJLZPCHHQS-UHFFFAOYSA-N
Activity Spreadsheet -- Enzyme Inhibition Constant Data from BindingDB
Found 1 hit for monomerid = 366224
Trg + Lig
Ki
nM
ΔG°
kcal/mole
IC50
nM
Kd
nM
EC50/IC50
nM
koff
s-1
kon
M-1s-1
pHTemp
°C
3-phosphoinositide-dependent protein kinase 1 [51-360]
(Homo sapiens (Human))
BDBM366224
(US9873693, Compound 147)
Show SMILES Fc1ccc(cc1)C(COc1ccc2[nH]c(=O)[nH]c2c1)NC(=O)c1cccn(Cc2ccc(F)c(F)c2)c1=O
Show InChI InChI=1S/C28H19F3N4O4/c29-18-6-4-17(5-7-18)25(15-39-19-8-10-23-24(13-19)34-28(38)33-23)32-26(36)20-2-1-11-35(27(20)37)14-16-3-9-21(30)22(31)12-16/h1-13,25H,14-15H2,(H,32,36)
US Patent
n/an/a<500n/an/an/an/an/an/a
Duquesne University
Assay Description
A PDK1 kinase assay was performed as follows. PDK1 (amino acids 51-360) and AKT2 (amino acids 140-467 fused to PIFtide, amino acids EEQEMFRDFDYIADW) ...
J Med Chem 51: 68-76 (2008)
BindingDB Entry DOI: 10.7270/Q2H41TRT