null
SMILES: CNC(=O)[C@H](COc1ccc2[nH]c(=O)[nH]c2c1)NC(=O)c1cccn(Cc2cc(F)c(F)c(F)c2)c1=O
InChI Key: InChIKey=MBSOZHGNYDEYJL-IBGZPJMESA-N
Activity Spreadsheet -- Enzyme Inhibition Constant Data from BindingDB
Found 1 hit for monomerid = 366234
Trg + Lig
Ki
nM
ΔG°
kcal/mole
IC50
nM
Kd
nM
EC50/IC50
nM
koff
s-1
kon
M-1s-1
pHTemp
°C
3-phosphoinositide-dependent protein kinase 1 [51-360]
(Homo sapiens (Human))
BDBM366234
(US9873693, Compound 157)
Show SMILES CNC(=O)[C@H](COc1ccc2[nH]c(=O)[nH]c2c1)NC(=O)c1cccn(Cc2cc(F)c(F)c(F)c2)c1=O |r|
Show InChI InChI=1S/C24H18F3N5O5/c1-28-22(34)19(11-37-13-4-5-17-18(9-13)31-24(36)30-17)29-21(33)14-3-2-6-32(23(14)35)10-12-7-15(25)20(27)16(26)8-12/h2-9,19H,10-11H2,1H3,(H,28,34)(H,29,33)/t19-/m0/s1
US Patent
n/an/a<500n/an/an/an/an/an/a
Duquesne University
Assay Description
A PDK1 kinase assay was performed as follows. PDK1 (amino acids 51-360) and AKT2 (amino acids 140-467 fused to PIFtide, amino acids EEQEMFRDFDYIADW) ...
J Med Chem 51: 68-76 (2008)
BindingDB Entry DOI: 10.7270/Q2H41TRT