null
SMILES: COc1ccnc(NCCC#CCCNC(=O)c2cccn(Cc3ccc(Cl)c(Cl)c3)c2=O)n1
InChI Key: InChIKey=RPDMVKUBXUQLOY-UHFFFAOYSA-N
Activity Spreadsheet -- Enzyme Inhibition Constant Data from BindingDB
Found 1 hit for monomerid = 366328
Trg + Lig
Ki
nM
ΔG°
kcal/mole
IC50
nM
Kd
nM
EC50/IC50
nM
koff
s-1
kon
M-1s-1
pHTemp
°C
3-phosphoinositide-dependent protein kinase 1 [51-360]
(Homo sapiens (Human))
BDBM366328
(US9873693, Compound 255)
Show SMILES COc1ccnc(NCCC#CCCNC(=O)c2cccn(Cc3ccc(Cl)c(Cl)c3)c2=O)n1
Show InChI InChI=1S/C24H23Cl2N5O3/c1-34-21-10-13-29-24(30-21)28-12-5-3-2-4-11-27-22(32)18-7-6-14-31(23(18)33)16-17-8-9-19(25)20(26)15-17/h6-10,13-15H,4-5,11-12,16H2,1H3,(H,27,32)(H,28,29,30)
US Patent
n/an/a<500n/an/an/an/an/an/a
Duquesne University
Assay Description
A PDK1 kinase assay was performed as follows. PDK1 (amino acids 51-360) and AKT2 (amino acids 140-467 fused to PIFtide, amino acids EEQEMFRDFDYIADW) ...
J Med Chem 51: 68-76 (2008)
BindingDB Entry DOI: 10.7270/Q2H41TRT