BDBM36697 Dansyltyrosine deriviative 14B
SMILES: CN(C)c1cccc2c(cccc12)S(=O)(=O)Oc1ccc(C[C@H](NS(=O)(=O)c2ccccc2Cl)C(O)=O)cc1
InChI Key: InChIKey=VLUBMQFHVGKMKM-QHCPKHFHSA-N
Data: 1 IC50
Activity Spreadsheet -- Enzyme Inhibition Constant Data from BindingDB
Found 1 hit for monomerid = 36697
Trg + Lig
Ki
nM
ΔG°
kcal/mole
IC50
nM
Kd
nM
EC50/IC50
nM
koff
s-1
kon
M-1s-1
pHTemp
°C
Thymidylate Synthase (TS)
(Lactobacillus casei)
BDBM36697
(Dansyltyrosine deriviative 14B)
Show SMILES CN(C)c1cccc2c(cccc12)S(=O)(=O)Oc1ccc(C[C@H](NS(=O)(=O)c2ccccc2Cl)C(O)=O)cc1 |r|
Show InChI InChI=1S/C27H25ClN2O7S2/c1-30(2)24-10-5-8-21-20(24)7-6-12-25(21)39(35,36)37-19-15-13-18(14-16-19)17-23(27(31)32)29-38(33,34)26-11-4-3-9-22(26)28/h3-16,23,29H,17H2,1-2H3,(H,31,32)/t23-/m0/s1
n/an/a 2.10E+4n/an/an/an/a7.420
Northwestern University
Assay Description
The enzyme assay were performed spectrophotometrically by following the absorbance at 340nm using a hewlett Packard 8453 UV spectrophotometer equippe...
Chem Biol 6: 319-31 (1999)
Article DOI: 10.1016/S1074-5521(99)80077-5
BindingDB Entry DOI: 10.7270/Q2S180VB