BDBM36698 Dansyltyrosine deriviative 15B
SMILES: CN(C)c1cccc2c(cccc12)S(=O)(=O)Oc1ccc(C[C@H](NS(=O)(=O)c2ccc(C)cc2)C(O)=O)cc1
InChI Key: InChIKey=MNLYIWCDLXFHQW-VWLOTQADSA-N
Data: 1 IC50
Activity Spreadsheet -- Enzyme Inhibition Constant Data from BindingDB
Found 1 hit for monomerid = 36698
Trg + Lig
Ki
nM
ΔG°
kcal/mole
IC50
nM
Kd
nM
EC50/IC50
nM
koff
s-1
kon
M-1s-1
pHTemp
°C
Thymidylate Synthase (TS)
(Lactobacillus casei)
BDBM36698
(Dansyltyrosine deriviative 15B)
Show SMILES CN(C)c1cccc2c(cccc12)S(=O)(=O)Oc1ccc(C[C@H](NS(=O)(=O)c2ccc(C)cc2)C(O)=O)cc1 |r|
Show InChI InChI=1S/C28H28N2O7S2/c1-19-10-16-22(17-11-19)38(33,34)29-25(28(31)32)18-20-12-14-21(15-13-20)37-39(35,36)27-9-5-6-23-24(27)7-4-8-26(23)30(2)3/h4-17,25,29H,18H2,1-3H3,(H,31,32)/t25-/m0/s1
n/an/a 2.00E+4n/an/an/an/a7.420
Northwestern University
Assay Description
The enzyme assay were performed spectrophotometrically by following the absorbance at 340nm using a hewlett Packard 8453 UV spectrophotometer equippe...
Chem Biol 6: 319-31 (1999)
Article DOI: 10.1016/S1074-5521(99)80077-5
BindingDB Entry DOI: 10.7270/Q2S180VB