BDBM36708 Dansyltyrosine deriviative 27B
SMILES: CN(C)c1ccc(cc1)\N=N\c1ccc(cc1)S(=O)(=O)N[C@@H](Cc1ccc(OS(=O)(=O)c2cccc3c(cccc23)N(C)C)cc1)C(O)=O
InChI Key: InChIKey=ZAKRSKUAXSDMEX-UYJASVSBSA-N
Data: 1 IC50
Activity Spreadsheet -- Enzyme Inhibition Constant Data from BindingDB
Found 1 hit for monomerid = 36708
Trg + Lig
Ki
nM
ΔG°
kcal/mole
IC50
nM
Kd
nM
EC50/IC50
nM
koff
s-1
kon
M-1s-1
pHTemp
°C
Thymidylate Synthase (TS)
(Lactobacillus casei)
BDBM36708
(Dansyltyrosine deriviative 27B)
Show SMILES CN(C)c1ccc(cc1)\N=N\c1ccc(cc1)S(=O)(=O)N[C@@H](Cc1ccc(OS(=O)(=O)c2cccc3c(cccc23)N(C)C)cc1)C(O)=O |r|
Show InChI InChI=1S/C35H35N5O7S2/c1-39(2)27-17-13-25(14-18-27)36-37-26-15-21-29(22-16-26)48(43,44)38-32(35(41)42)23-24-11-19-28(20-12-24)47-49(45,46)34-10-6-7-30-31(34)8-5-9-33(30)40(3)4/h5-22,32,38H,23H2,1-4H3,(H,41,42)/b37-36+/t32-/m0/s1
n/an/a>1.00E+5n/an/an/an/a7.420
Northwestern University
Assay Description
The enzyme assay were performed spectrophotometrically by following the absorbance at 340nm using a hewlett Packard 8453 UV spectrophotometer equippe...
Chem Biol 6: 319-31 (1999)
Article DOI: 10.1016/S1074-5521(99)80077-5
BindingDB Entry DOI: 10.7270/Q2S180VB