BDBM36710 Dansyltyrosine deriviative 29B
SMILES: CN(C)c1cccc2c(cccc12)S(=O)(=O)Oc1ccc(C[C@H](NS(=O)(=O)c2cccc3cccnc23)C(O)=O)cc1
InChI Key: InChIKey=UXYCMTKVHKWWBM-VWLOTQADSA-N
Data: 1 IC50
Activity Spreadsheet -- Enzyme Inhibition Constant Data from BindingDB
Found 1 hit for monomerid = 36710
Trg + Lig
Ki
nM
ΔG°
kcal/mole
IC50
nM
Kd
nM
EC50/IC50
nM
koff
s-1
kon
M-1s-1
pHTemp
°C
Thymidylate Synthase (TS)
(Lactobacillus casei)
BDBM36710
(Dansyltyrosine deriviative 29B)
Show SMILES CN(C)c1cccc2c(cccc12)S(=O)(=O)Oc1ccc(C[C@H](NS(=O)(=O)c2cccc3cccnc23)C(O)=O)cc1 |r|
Show InChI InChI=1S/C30H27N3O7S2/c1-33(2)26-11-4-10-24-23(26)9-5-12-27(24)42(38,39)40-22-16-14-20(15-17-22)19-25(30(34)35)32-41(36,37)28-13-3-7-21-8-6-18-31-29(21)28/h3-18,25,32H,19H2,1-2H3,(H,34,35)/t25-/m0/s1
n/an/a 7.00E+3n/an/an/an/a7.420
Northwestern University
Assay Description
The enzyme assay were performed spectrophotometrically by following the absorbance at 340nm using a hewlett Packard 8453 UV spectrophotometer equippe...
Chem Biol 6: 319-31 (1999)
Article DOI: 10.1016/S1074-5521(99)80077-5
BindingDB Entry DOI: 10.7270/Q2S180VB