BDBM367260 US10226464, Compound 28
SMILES: CCOc1cc2oc3nc(=O)[nH]c(=O)c3cc2cc1F
InChI Key: InChIKey=HORLZAWADNENIO-UHFFFAOYSA-N
Data: 2 IC50
Activity Spreadsheet -- Enzyme Inhibition Constant Data from BindingDB
Found 2 hits for monomerid = 367260
Trg + Lig
Ki
nM
ΔG°
kcal/mole
IC50
nM
Kd
nM
EC50/IC50
nM
koff
s-1
kon
M-1s-1
pHTemp
°C
Nuclear factor NF-kappa-B (NF-kB)
(Homo sapiens (Human))
BDBM367260
(US10226464, Compound 28)
Show SMILES CCOc1cc2oc3nc(=O)[nH]c(=O)c3cc2cc1F
Show InChI InChI=1S/C13H9FN2O4/c1-2-19-10-5-9-6(4-8(10)14)3-7-11(17)15-13(18)16-12(7)20-9/h3-5H,2H2,1H3,(H,15,17,18)
US Patent
n/an/a<5.00E+3n/an/an/an/an/an/a
Amgen
Assay Description
NFκB/Jurkat/GFP transcriptional reporter cell line was obtained from SBI System Biosciences. NF-κB/Jurkat/GFP™ Reporter cells (5×105 cells)...
Bioorg Med Chem Lett 17: 5384-9 (2007)
BindingDB Entry DOI: 10.7270/Q2028TVG
Nuclear factor NF-kappa-B (NF-kB)
(Homo sapiens (Human))
BDBM367260
(US10226464, Compound 28)
Show SMILES CCOc1cc2oc3nc(=O)[nH]c(=O)c3cc2cc1F
Show InChI InChI=1S/C13H9FN2O4/c1-2-19-10-5-9-6(4-8(10)14)3-7-11(17)15-13(18)16-12(7)20-9/h3-5H,2H2,1H3,(H,15,17,18)
US Patent
n/an/a<500n/an/an/an/an/an/a
Amgen
Assay Description
DNA binding reaction (20 μL) was carried out in 1×DNA Binding Buffer (10 mM Tris, 40 mM NaCl, 1 mM EDTA, 4% glycerol) with 10 nM c-Rel protein a...
Bioorg Med Chem Lett 17: 5384-9 (2007)
BindingDB Entry DOI: 10.7270/Q2028TVG