BDBM367274 US10226464, Compound 41
SMILES: CC(C)(C)CCOc1ccc2cc3c(nc(=O)[nH]c3=O)oc2c1Cl
InChI Key: InChIKey=NFBHGLAAZZJQFO-UHFFFAOYSA-N
Data: 2 IC50
Activity Spreadsheet -- Enzyme Inhibition Constant Data from BindingDB
Found 2 hits for monomerid = 367274
Trg + Lig
Ki
nM
ΔG°
kcal/mole
IC50
nM
Kd
nM
EC50/IC50
nM
koff
s-1
kon
M-1s-1
pHTemp
°C
nf-kb gfp
(Homo sapiens (Human))
BDBM367274
(US10226464, Compound 41)
Show SMILES CC(C)(C)CCOc1ccc2cc3c(nc(=O)[nH]c3=O)oc2c1Cl
Show InChI InChI=1S/C17H17ClN2O4/c1-17(2,3)6-7-23-11-5-4-9-8-10-14(21)19-16(22)20-15(10)24-13(9)12(11)18/h4-5,8H,6-7H2,1-3H3,(H,19,21,22)
US Patent
n/an/a<1.00E+4n/an/an/an/an/an/a
Amgen
Assay Description
NFκB/Jurkat/GFP transcriptional reporter cell line was obtained from SBI System Biosciences. NF-κB/Jurkat/GFP™ Reporter cells (5×105 cells)...
Bioorg Med Chem Lett 17: 5384-9 (2007)
BindingDB Entry DOI: 10.7270/Q2028TVG
emsa
(Homo sapiens (Human))
BDBM367274
(US10226464, Compound 41)
Show SMILES CC(C)(C)CCOc1ccc2cc3c(nc(=O)[nH]c3=O)oc2c1Cl
Show InChI InChI=1S/C17H17ClN2O4/c1-17(2,3)6-7-23-11-5-4-9-8-10-14(21)19-16(22)20-15(10)24-13(9)12(11)18/h4-5,8H,6-7H2,1-3H3,(H,19,21,22)
US Patent
n/an/a<500n/an/an/an/an/an/a
Amgen
Assay Description
DNA binding reaction (20 μL) was carried out in 1×DNA Binding Buffer (10 mM Tris, 40 mM NaCl, 1 mM EDTA, 4% glycerol) with 10 nM c-Rel protein a...
Bioorg Med Chem Lett 17: 5384-9 (2007)
BindingDB Entry DOI: 10.7270/Q2028TVG