BDBM367279 US10226464, Compound 46
SMILES: CCCCCCOc1ccc2cc3c(nc(=O)[nH]c3=O)oc2c1F
InChI Key: InChIKey=SKQHDCZMRKUDII-UHFFFAOYSA-N
Data: 2 IC50
Activity Spreadsheet -- Enzyme Inhibition Constant Data from BindingDB
Found 2 hits for monomerid = 367279
Trg + Lig
Ki
nM
ΔG°
kcal/mole
IC50
nM
Kd
nM
EC50/IC50
nM
koff
s-1
kon
M-1s-1
pHTemp
°C
Nuclear factor NF-kappa-B (NF-kB)
(Homo sapiens (Human))
BDBM367279
(US10226464, Compound 46)
Show SMILES CCCCCCOc1ccc2cc3c(nc(=O)[nH]c3=O)oc2c1F
Show InChI InChI=1S/C17H17FN2O4/c1-2-3-4-5-8-23-12-7-6-10-9-11-15(21)19-17(22)20-16(11)24-14(10)13(12)18/h6-7,9H,2-5,8H2,1H3,(H,19,21,22)
US Patent
n/an/a<5.00E+3n/an/an/an/an/an/a
Amgen
Assay Description
NFκB/Jurkat/GFP transcriptional reporter cell line was obtained from SBI System Biosciences. NF-κB/Jurkat/GFP™ Reporter cells (5×105 cells)...
Bioorg Med Chem Lett 17: 5384-9 (2007)
BindingDB Entry DOI: 10.7270/Q2028TVG
Nuclear factor NF-kappa-B (NF-kB)
(Homo sapiens (Human))
BDBM367279
(US10226464, Compound 46)
Show SMILES CCCCCCOc1ccc2cc3c(nc(=O)[nH]c3=O)oc2c1F
Show InChI InChI=1S/C17H17FN2O4/c1-2-3-4-5-8-23-12-7-6-10-9-11-15(21)19-17(22)20-16(11)24-14(10)13(12)18/h6-7,9H,2-5,8H2,1H3,(H,19,21,22)
US Patent
n/an/a<500n/an/an/an/an/an/a
Amgen
Assay Description
DNA binding reaction (20 μL) was carried out in 1×DNA Binding Buffer (10 mM Tris, 40 mM NaCl, 1 mM EDTA, 4% glycerol) with 10 nM c-Rel protein a...
Bioorg Med Chem Lett 17: 5384-9 (2007)
BindingDB Entry DOI: 10.7270/Q2028TVG