BDBM367304 US10226464, Compound 71
SMILES: COCCOCCCOc1ccc2cc3c(nc(=O)[nH]c3=O)oc2c1
InChI Key: InChIKey=FFHMGSNPXXHWPJ-UHFFFAOYSA-N
Data: 2 IC50
Activity Spreadsheet -- Enzyme Inhibition Constant Data from BindingDB
Found 2 hits for monomerid = 367304
Trg + Lig
Ki
nM
ΔG°
kcal/mole
IC50
nM
Kd
nM
EC50/IC50
nM
koff
s-1
kon
M-1s-1
pHTemp
°C
Nuclear factor NF-kappa-B (NF-kB)
(Homo sapiens (Human))
BDBM367304
(US10226464, Compound 71)
Show SMILES COCCOCCCOc1ccc2cc3c(nc(=O)[nH]c3=O)oc2c1
Show InChI InChI=1S/C17H18N2O6/c1-22-7-8-23-5-2-6-24-12-4-3-11-9-13-15(20)18-17(21)19-16(13)25-14(11)10-12/h3-4,9-10H,2,5-8H2,1H3,(H,18,20,21)
US Patent
n/an/a<5.00E+3n/an/an/an/an/an/a
Amgen
Assay Description
NFκB/Jurkat/GFP transcriptional reporter cell line was obtained from SBI System Biosciences. NF-κB/Jurkat/GFP™ Reporter cells (5×105 cells)...
Bioorg Med Chem Lett 17: 5384-9 (2007)
BindingDB Entry DOI: 10.7270/Q2028TVG
Nuclear factor NF-kappa-B (NF-kB)
(Homo sapiens (Human))
BDBM367304
(US10226464, Compound 71)
Show SMILES COCCOCCCOc1ccc2cc3c(nc(=O)[nH]c3=O)oc2c1
Show InChI InChI=1S/C17H18N2O6/c1-22-7-8-23-5-2-6-24-12-4-3-11-9-13-15(20)18-17(21)19-16(13)25-14(11)10-12/h3-4,9-10H,2,5-8H2,1H3,(H,18,20,21)
US Patent
n/an/a<1.00E+3n/an/an/an/an/an/a
Amgen
Assay Description
DNA binding reaction (20 μL) was carried out in 1×DNA Binding Buffer (10 mM Tris, 40 mM NaCl, 1 mM EDTA, 4% glycerol) with 10 nM c-Rel protein a...
Bioorg Med Chem Lett 17: 5384-9 (2007)
BindingDB Entry DOI: 10.7270/Q2028TVG