BDBM3700 2-({4-[(3-bromophenyl)amino]pyrido[3,4-d]pyrimidin-6-yl}amino)ethan-1-ol::4-[(3-Bromophenyl)amino]-6-[(2-hydroxyethyl)amino]-pyrido[3,4-d]pyrimidine::PD158780 Analog 5d
SMILES: OCCNc1cc2c(Nc3cccc(Br)c3)ncnc2cn1
InChI Key: InChIKey=BSMQFXOOMVGQQY-UHFFFAOYSA-N
Data: 1 IC50
Activity Spreadsheet -- Enzyme Inhibition Constant Data from BindingDB
Found 1 hit for monomerid = 3700
Trg + Lig
Ki
nM
ΔG°
kcal/mole
IC50
nM
Kd
nM
EC50/IC50
nM
koff
s-1
kon
M-1s-1
pHTemp
°C
Epidermal growth factor receptor
(Homo sapiens (Human))
BDBM3700
(2-({4-[(3-bromophenyl)amino]pyrido[3,4-d]pyrimidin...)
Show SMILES OCCNc1cc2c(Nc3cccc(Br)c3)ncnc2cn1
Show InChI InChI=1S/C15H14BrN5O/c16-10-2-1-3-11(6-10)21-15-12-7-14(17-4-5-22)18-8-13(12)19-9-20-15/h1-3,6-9,22H,4-5H2,(H,17,18)(H,19,20,21)
n/an/a 0.190n/an/an/an/a7.422
University of Auckland
Assay Description
IC50 is the inhibitor concentration which inhibits 50% of kinase activity that catalyzes the transfer of the terminal phosphate from [gamma-32P] labe...
J Med Chem 41: 742-51 (1998)
Article DOI: 10.1021/jm970641d
BindingDB Entry DOI: 10.7270/Q2DB800T