BDBM37108 5-bromanyl-N-(pyridin-4-ylmethyl)thiophene-2-sulfonamide::5-bromo-N-(4-pyridinylmethyl)-2-thiophenesulfonamide::5-bromo-N-(4-pyridylmethyl)thiophene-2-sulfonamide::5-bromo-N-(pyridin-4-ylmethyl)-2-thiophenesulfonamide::5-bromo-N-(pyridin-4-ylmethyl)thiophene-2-sulfonamide::MLS000063220::SMR000074767::cid_936105
SMILES: Brc1ccc(s1)S(=O)(=O)NCc1ccncc1
InChI Key: InChIKey=QSMVBOULCKMAMR-UHFFFAOYSA-N
Data: 7 IC50  3 EC50
Activity Spreadsheet -- Enzyme Inhibition Constant Data from BindingDB
Found 10 hits for monomerid = 37108
Trg + Lig
Ki
nM
ΔG°
kcal/mole
IC50
nM
Kd
nM
EC50/IC50
nM
koff
s-1
kon
M-1s-1
pHTemp
°C
Sphingosine 1-phosphate receptor 1
(Homo sapiens (Human))
BDBM37108
(5-bromanyl-N-(pyridin-4-ylmethyl)thiophene-2-sulfo...)
Show SMILES Brc1ccc(s1)S(=O)(=O)NCc1ccncc1
Show InChI InChI=1S/C10H9BrN2O2S2/c11-9-1-2-10(16-9)17(14,15)13-7-8-3-5-12-6-4-8/h1-6,13H,7H2
Reactome pathway
PCBioAssay
n/an/an/an/a 2.21E+3n/an/an/an/a
The Scripps Research Institute Molecular Screening Center
Curated by PubChem BioAssay
Assay Description
Source (MLSCN Center Name): The Scripps Research Institute Molecular Screening Center Center Affiliation: The Scripps Research Institute, TSRI Assay ...
PubChem Bioassay (2007)
BindingDB Entry DOI: 10.7270/Q2ZC817P
Sphingosine 1-phosphate receptor 1
(Homo sapiens (Human))
BDBM37108
(5-bromanyl-N-(pyridin-4-ylmethyl)thiophene-2-sulfo...)
Show SMILES Brc1ccc(s1)S(=O)(=O)NCc1ccncc1
Show InChI InChI=1S/C10H9BrN2O2S2/c11-9-1-2-10(16-9)17(14,15)13-7-8-3-5-12-6-4-8/h1-6,13H,7H2
Reactome pathway
PCBioAssay
n/an/an/an/a>9.51E+4n/an/an/an/a
The Scripps Research Institute Molecular Screening Center
Curated by PubChem BioAssay
Assay Description
Source (MLSCN Center Name): The Scripps Research Institute Molecular Screening Center Center Affiliation: The Scripps Research Institute, TSRI Assay ...
PubChem Bioassay (2007)
BindingDB Entry DOI: 10.7270/Q25X2795
Sphingosine 1-phosphate receptor 1
(Homo sapiens (Human))
BDBM37108
(5-bromanyl-N-(pyridin-4-ylmethyl)thiophene-2-sulfo...)
Show SMILES Brc1ccc(s1)S(=O)(=O)NCc1ccncc1
Show InChI InChI=1S/C10H9BrN2O2S2/c11-9-1-2-10(16-9)17(14,15)13-7-8-3-5-12-6-4-8/h1-6,13H,7H2
Reactome pathway
PCBioAssay
n/an/an/an/a 2.63E+3n/an/an/an/a
The Scripps Research Institute Molecular Screening Center
Curated by PubChem BioAssay
Assay Description
Source (MLSCN Center Name): The Scripps Research Institute Molecular Screening Center Center Affiliation: The Scripps Research Institute, TSRI Assay ...
PubChem Bioassay (2007)
BindingDB Entry DOI: 10.7270/Q2251GJ9
Steroidogenic Factor 1
(Homo sapiens (Human))
BDBM37108
(5-bromanyl-N-(pyridin-4-ylmethyl)thiophene-2-sulfo...)
Show SMILES Brc1ccc(s1)S(=O)(=O)NCc1ccncc1
Show InChI InChI=1S/C10H9BrN2O2S2/c11-9-1-2-10(16-9)17(14,15)13-7-8-3-5-12-6-4-8/h1-6,13H,7H2
Reactome pathway
PCBioAssay
n/an/a 108n/an/an/an/an/an/a
The Scripps Research Institute Molecular Screening Center
Curated by PubChem BioAssay
Assay Description
Source (MLSCN Center Name): The Scripps Research Institute Molecular Screening Center Center Affiliation: The Scripps Research Institute, TSRI Assay ...
PubChem Bioassay (2007)
BindingDB Entry DOI: 10.7270/Q2319T8T
Galanin receptor 3
(Homo sapiens (Human))
BDBM37108
(5-bromanyl-N-(pyridin-4-ylmethyl)thiophene-2-sulfo...)
Show SMILES Brc1ccc(s1)S(=O)(=O)NCc1ccncc1
Show InChI InChI=1S/C10H9BrN2O2S2/c11-9-1-2-10(16-9)17(14,15)13-7-8-3-5-12-6-4-8/h1-6,13H,7H2
Reactome pathway
PCBioAssay
n/an/a 2.06E+3n/an/an/an/an/an/a
The Scripps Research Institute Molecular Screening Center
Curated by PubChem BioAssay
PubChem Bioassay (2013)
BindingDB Entry DOI: 10.7270/Q270802Q
Nuclear receptor ROR-alpha
(Homo sapiens (Human))
BDBM37108
(5-bromanyl-N-(pyridin-4-ylmethyl)thiophene-2-sulfo...)
Show SMILES Brc1ccc(s1)S(=O)(=O)NCc1ccncc1
Show InChI InChI=1S/C10H9BrN2O2S2/c11-9-1-2-10(16-9)17(14,15)13-7-8-3-5-12-6-4-8/h1-6,13H,7H2
Reactome pathway
PCBioAssay
n/an/a 2.20E+3n/an/an/an/an/an/a
The Scripps Research Institute Molecular Screening Center
Curated by PubChem BioAssay
Assay Description
Source (MLSCN Center Name): The Scripps Research Institute Molecular Screening Center Center Affiliation: The Scripps Research Institute, TSRI Assay ...
PubChem Bioassay (2007)
BindingDB Entry DOI: 10.7270/Q2TH8K3N
Galanin receptor 2
(Homo sapiens (Human))
BDBM37108
(5-bromanyl-N-(pyridin-4-ylmethyl)thiophene-2-sulfo...)
Show SMILES Brc1ccc(s1)S(=O)(=O)NCc1ccncc1
Show InChI InChI=1S/C10H9BrN2O2S2/c11-9-1-2-10(16-9)17(14,15)13-7-8-3-5-12-6-4-8/h1-6,13H,7H2
Reactome pathway
PCBioAssay
n/an/a>4.20E+4n/an/an/an/an/an/a
The Scripps Research Institute Molecular Screening Center
Curated by PubChem BioAssay
Assay Description
Source (MLSCN Center Name): The Scripps Research Institute Molecular Screening Center Affiliation: The Scripps Research Institute (TSRI) Assay Provid...
PubChem Bioassay (2008)
BindingDB Entry DOI: 10.7270/Q2W094B7
Steroidogenic Factor 1
(Homo sapiens (Human))
BDBM37108
(5-bromanyl-N-(pyridin-4-ylmethyl)thiophene-2-sulfo...)
Show SMILES Brc1ccc(s1)S(=O)(=O)NCc1ccncc1
Show InChI InChI=1S/C10H9BrN2O2S2/c11-9-1-2-10(16-9)17(14,15)13-7-8-3-5-12-6-4-8/h1-6,13H,7H2
Reactome pathway
PCBioAssay
n/an/a 3.74E+3n/an/an/an/an/an/a
The Scripps Research Institute Molecular Screening Center
Curated by PubChem BioAssay
Assay Description
Source (MLSCN Center Name): The Scripps Research Institute Molecular Screening Center Center Affiliation: The Scripps Research Institute, TSRI Assay ...
PubChem Bioassay (2007)
BindingDB Entry DOI: 10.7270/Q2PR7TCX
Nuclear receptor ROR-alpha
(Homo sapiens (Human))
BDBM37108
(5-bromanyl-N-(pyridin-4-ylmethyl)thiophene-2-sulfo...)
Show SMILES Brc1ccc(s1)S(=O)(=O)NCc1ccncc1
Show InChI InChI=1S/C10H9BrN2O2S2/c11-9-1-2-10(16-9)17(14,15)13-7-8-3-5-12-6-4-8/h1-6,13H,7H2
Reactome pathway
PCBioAssay
n/an/a 185n/an/an/an/an/an/a
The Scripps Research Institute Molecular Screening Center
Curated by PubChem BioAssay
Assay Description
Source (MLSCN Center Name): The Scripps Research Institute Molecular Screening Center Center Affiliation: The Scripps Research Institute, TSRI Assay ...
PubChem Bioassay (2007)
BindingDB Entry DOI: 10.7270/Q26Q1VNZ
Galanin receptor 2
(Homo sapiens (Human))
BDBM37108
(5-bromanyl-N-(pyridin-4-ylmethyl)thiophene-2-sulfo...)
Show SMILES Brc1ccc(s1)S(=O)(=O)NCc1ccncc1
Show InChI InChI=1S/C10H9BrN2O2S2/c11-9-1-2-10(16-9)17(14,15)13-7-8-3-5-12-6-4-8/h1-6,13H,7H2
Reactome pathway
PCBioAssay
n/an/a>4.20E+4n/an/an/an/an/an/a
The Scripps Research Institute Molecular Screening Center
Curated by PubChem BioAssay
Assay Description
Source (MLSCN Center Name): The Scripps Research Institute Molecular Screening Center Affiliation: The Scripps Florida Research Institute, TSRI Assay...
PubChem Bioassay (2008)
BindingDB Entry DOI: 10.7270/Q2D21W05