null
SMILES: C[C@@H]1CC[C@@H](CN1C)Nc1cnn(C)c(=O)c1Cl
InChI Key: InChIKey=CFLOQDRDTBXOJC-BDAKNGLRSA-N
Activity Spreadsheet -- Enzyme Inhibition Constant Data from BindingDB
Found 1 hit for monomerid = 371547
Trg + Lig
Ki
nM
ΔG°
kcal/mole
IC50
nM
Kd
nM
EC50/IC50
nM
koff
s-1
kon
M-1s-1
pHTemp
°C
Histone acetyltransferase KAT2B
(Homo sapiens (Human))
BDBM371547
(US10239861, Example 27)
Show SMILES C[C@@H]1CC[C@@H](CN1C)Nc1cnn(C)c(=O)c1Cl |r|
Show InChI InChI=1S/C12H19ClN4O/c1-8-4-5-9(7-16(8)2)15-10-6-14-17(3)12(18)11(10)13/h6,8-9,15H,4-5,7H2,1-3H3/t8-,9+/m1/s1
NCI pathway
Reactome pathway
US Patent
n/an/a 144n/an/an/an/an/an/a
GLSynthesis Inc.
Assay Description
His/Flag epitope tagged PCAF719-832 bromodomain was cloned, expressed and purified to homogeneity in-house. PCAF bromodomain binding and inhibition o...
J Med Chem 48: 3919-29 (2005)
BindingDB Entry DOI: 10.7270/Q2X06991