BDBM371635 (R)-4-(2-(1H-1,2,3-Triazol-1-yl)-4-(trifluoromethyl)phenyl)-N-(6-fluoropyridin-2-yl) chromane-7-sulfonamide::US10239869, Example 60
SMILES: Fc1cccc(NS(=O)(=O)c2ccc3[C@H](CCOc3c2)c2ccc(cc2-n2ccnn2)C(F)(F)F)n1
InChI Key: InChIKey=JKJIATXPNOQKCJ-MRXNPFEDSA-N
Data: 3 IC50
Activity Spreadsheet -- Enzyme Inhibition Constant Data from BindingDB
Found 3 hits for monomerid = 371635
Trg + Lig
Ki
nM
ΔG°
kcal/mole
IC50
nM
Kd
nM
EC50/IC50
nM
koff
s-1
kon
M-1s-1
pHTemp
°C
Sodium channel protein type 9 subunit alpha
(Homo sapiens (Human))
BDBM371635
((R)-4-(2-(1H-1,2,3-Triazol-1-yl)-4-(trifluoromethy...)
Show SMILES Fc1cccc(NS(=O)(=O)c2ccc3[C@H](CCOc3c2)c2ccc(cc2-n2ccnn2)C(F)(F)F)n1
Show InChI InChI=1S/C23H17F4N5O3S/c24-21-2-1-3-22(29-21)30-36(33,34)15-5-7-18-16(8-11-35-20(18)13-15)17-6-4-14(23(25,26)27)12-19(17)32-10-9-28-31-32/h1-7,9-10,12-13,16H,8,11H2,(H,29,30)/t16-/m1/s1
US Patent
n/an/a 0.300n/an/an/an/an/an/a
University of California at San Francisco
Assay Description
HEK-293 cells overexpressing the channel of interest were seeded in a 96-well plate at a density of 30000 cells/well and incubated at 37° C./5% CO2 f...
J Med Chem 51: 545-52 (2008)
BindingDB Entry DOI: 10.7270/Q2NG4SZX
Sodium channel protein type 9 subunit alpha
(Homo sapiens (Human))
BDBM371635
((R)-4-(2-(1H-1,2,3-Triazol-1-yl)-4-(trifluoromethy...)
Show SMILES Fc1cccc(NS(=O)(=O)c2ccc3[C@H](CCOc3c2)c2ccc(cc2-n2ccnn2)C(F)(F)F)n1
Show InChI InChI=1S/C23H17F4N5O3S/c24-21-2-1-3-22(29-21)30-36(33,34)15-5-7-18-16(8-11-35-20(18)13-15)17-6-4-14(23(25,26)27)12-19(17)32-10-9-28-31-32/h1-7,9-10,12-13,16H,8,11H2,(H,29,30)/t16-/m1/s1
n/an/a 1.10n/an/an/an/an/an/a
Lupin Ltd.
Curated by ChEMBL
Assay Description
Inhibition of Nav1.7 (unknown origin) expressed in HEK293 cells assessed as reduction in veratridine-induced depolarization preincubated for 15 to 20...
J Med Chem 63: 6107-6133 (2020)
Sodium channel protein type 5 subunit alpha
(Homo sapiens (Human))
BDBM371635
((R)-4-(2-(1H-1,2,3-Triazol-1-yl)-4-(trifluoromethy...)
Show SMILES Fc1cccc(NS(=O)(=O)c2ccc3[C@H](CCOc3c2)c2ccc(cc2-n2ccnn2)C(F)(F)F)n1
Show InChI InChI=1S/C23H17F4N5O3S/c24-21-2-1-3-22(29-21)30-36(33,34)15-5-7-18-16(8-11-35-20(18)13-15)17-6-4-14(23(25,26)27)12-19(17)32-10-9-28-31-32/h1-7,9-10,12-13,16H,8,11H2,(H,29,30)/t16-/m1/s1
US Patent
n/an/a>1.00E+4n/an/an/an/an/an/a
University of California at San Francisco
Assay Description
HEK-293 cells overexpressing the channel of interest were seeded in a 96-well plate at a density of 30000 cells/well and incubated at 37° C./5% CO2 f...
J Med Chem 51: 545-52 (2008)
BindingDB Entry DOI: 10.7270/Q2NG4SZX