BDBM371695 4-(2-morpholino-4-(trifluoromethyl)phenyl)-N-(pyrimidin-4-yl)chroman-7-sulfonamide::US10239869, Example 121
SMILES: FC(F)(F)c1ccc([C@H]2CCOc3cc(ccc23)S(=O)(=O)Nc2ccncn2)c(c1)N1CCOCC1
InChI Key: InChIKey=KQJDXTLVXINOPH-GOSISDBHSA-N
Data: 4 IC50
Activity Spreadsheet -- Enzyme Inhibition Constant Data from BindingDB
Found 4 hits for monomerid = 371695
Trg + Lig
Ki
nM
ΔG°
kcal/mole
IC50
nM
Kd
nM
EC50/IC50
nM
koff
s-1
kon
M-1s-1
pHTemp
°C
Sodium channel protein type 9 subunit alpha
(Homo sapiens (Human))
BDBM371695
(4-(2-morpholino-4-(trifluoromethyl)phenyl)-N-(pyri...)
Show SMILES FC(F)(F)c1ccc([C@H]2CCOc3cc(ccc23)S(=O)(=O)Nc2ccncn2)c(c1)N1CCOCC1 |r|
Show InChI InChI=1S/C24H23F3N4O4S/c25-24(26,27)16-1-3-19(21(13-16)31-8-11-34-12-9-31)18-6-10-35-22-14-17(2-4-20(18)22)36(32,33)30-23-5-7-28-15-29-23/h1-5,7,13-15,18H,6,8-12H2,(H,28,29,30)/t18-/m1/s1
US Patent
n/an/a 3n/an/an/an/an/an/a
University of California at San Francisco
Assay Description
HEK-293 cells overexpressing the channel of interest were seeded in a 96-well plate at a density of 30000 cells/well and incubated at 37° C./5% CO2 f...
J Med Chem 51: 545-52 (2008)
BindingDB Entry DOI: 10.7270/Q2NG4SZX
Sodium channel protein type 5 subunit alpha/beta-1/beta-2
(Homo sapiens (Human))
BDBM371695
(4-(2-morpholino-4-(trifluoromethyl)phenyl)-N-(pyri...)
Show SMILES FC(F)(F)c1ccc([C@H]2CCOc3cc(ccc23)S(=O)(=O)Nc2ccncn2)c(c1)N1CCOCC1 |r|
Show InChI InChI=1S/C24H23F3N4O4S/c25-24(26,27)16-1-3-19(21(13-16)31-8-11-34-12-9-31)18-6-10-35-22-14-17(2-4-20(18)22)36(32,33)30-23-5-7-28-15-29-23/h1-5,7,13-15,18H,6,8-12H2,(H,28,29,30)/t18-/m1/s1
n/an/a 248n/an/an/an/an/an/a
Lupin Ltd.
Curated by ChEMBL
Assay Description
Inhibition of Nav1.5 (unknown origin) expressed in HEK293 cells assessed as reduction in veratridine-induced depolarization preincubated for 15 to 20...
J Med Chem 63: 6107-6133 (2020)
Sodium channel protein type 9 subunit alpha
(Homo sapiens (Human))
BDBM371695
(4-(2-morpholino-4-(trifluoromethyl)phenyl)-N-(pyri...)
Show SMILES FC(F)(F)c1ccc([C@H]2CCOc3cc(ccc23)S(=O)(=O)Nc2ccncn2)c(c1)N1CCOCC1 |r|
Show InChI InChI=1S/C24H23F3N4O4S/c25-24(26,27)16-1-3-19(21(13-16)31-8-11-34-12-9-31)18-6-10-35-22-14-17(2-4-20(18)22)36(32,33)30-23-5-7-28-15-29-23/h1-5,7,13-15,18H,6,8-12H2,(H,28,29,30)/t18-/m1/s1
n/an/a 3n/an/an/an/an/an/a
Lupin Ltd.
Curated by ChEMBL
Assay Description
Inhibition of Nav1.7 (unknown origin) expressed in HEK293 cells assessed as reduction in veratridine-induced depolarization preincubated for 15 to 20...
J Med Chem 63: 6107-6133 (2020)
Sodium channel protein type 5 subunit alpha
(Homo sapiens (Human))
BDBM371695
(4-(2-morpholino-4-(trifluoromethyl)phenyl)-N-(pyri...)
Show SMILES FC(F)(F)c1ccc([C@H]2CCOc3cc(ccc23)S(=O)(=O)Nc2ccncn2)c(c1)N1CCOCC1 |r|
Show InChI InChI=1S/C24H23F3N4O4S/c25-24(26,27)16-1-3-19(21(13-16)31-8-11-34-12-9-31)18-6-10-35-22-14-17(2-4-20(18)22)36(32,33)30-23-5-7-28-15-29-23/h1-5,7,13-15,18H,6,8-12H2,(H,28,29,30)/t18-/m1/s1
US Patent
n/an/a 248n/an/an/an/an/an/a
University of California at San Francisco
Assay Description
HEK-293 cells overexpressing the channel of interest were seeded in a 96-well plate at a density of 30000 cells/well and incubated at 37° C./5% CO2 f...
J Med Chem 51: 545-52 (2008)
BindingDB Entry DOI: 10.7270/Q2NG4SZX